{"text_format":"1","workbook":"xlsx","n_sheets":16,"sheets":["Présentation","Activité1","Activité2","Activité3","FicheApp01","FicheApp02","FicheApp03","FicheApp04","FicheApp05","FicheApp06","FicheApp07","FicheApp08","FicheApp09","FicheApp10","FicheApp11","FicheApp12"],"not_rendered":{"charts":0,"images":0,"macros":1,"external_links":0,"defined_names":16,"comments":0,"pivot_tables":0},"unopened":[],"bounds":{"document_bytes":16777216,"sheet_cells":100000,"rows_first":2000,"rows_last":500,"rows_between":2000,"halvings":0,"cell_chars":16384,"cell_head_chars":4096},"cells_cut":0,"cells_raw":0,"read":"whole","date_system":"1900"}

{"sheet":"Présentation","index":0,"n_rows":30,"n_cols":17,"rows_kept":30,"cut":false,"hidden":false,"merged":[[3,1,3,4]]}
[]
["Feuille Présentation",null,"Veuillez compléter uniquement les cellules orange",null,null,null,null,null,null,null,"Nom et prénom des candidats","EP1","EP2","EP3","EP1 Coef","EP2 Coef","EP3 Coef"]
[null,null,null,null,null,null,null,null,"Apprenant",1,"N&P Apprenant 1",{"$f":"Activité1!B$35","v":"Note"},{"$f":"Activité2!B$35","v":"Note"},{"$f":"Activité3!B$35","v":"Note"},{"$f":"L3*$G$7","v":{"$error":"#VALUE!"}},{"$f":"M3*$G$8","v":{"$error":"#VALUE!"}},{"$f":"N3*$G$9","v":{"$error":"#VALUE!"}}]
["Etablissement","Nom de l'établissement",null,null,null,null,null,null,"Apprenant",2,"N&P Apprenant 2",{"$f":"Activité1!C$35","v":"Note"},{"$f":"Activité2!C$35","v":"Note"},{"$f":"Activité3!C$35","v":"Note"},{"$f":"L4*$G$7","v":{"$error":"#VALUE!"}},{"$f":"M4*$G$8","v":{"$error":"#VALUE!"}},{"$f":"N4*$G$9","v":{"$error":"#VALUE!"}}]
["Diplôme","Seconde professionnelle [F] MHR",null,null,null,null,null,null,"Apprenant",3,"N&P Apprenant 3",{"$f":"Activité1!D$35","v":"Note"},{"$f":"Activité2!D$35","v":"Note"},{"$f":"Activité3!D$35","v":"Note"},{"$error":"#VALUE!"},{"$error":"#VALUE!"},{"$error":"#VALUE!"}]
[null,null,null,null,null,null,"Coefficient",null,"Apprenant",4,"N&P Apprenant 4",{"$f":"Activité1!E$35","v":"Note"},{"$f":"Activité2!E$35","v":"Note"},{"$f":"Activité3!E$35","v":"Note"},{"$error":"#VALUE!"},{"$error":"#VALUE!"},{"$error":"#VALUE!"}]
["Titre épreuve 1","Titre activité 1",null,null,null,null,1,null,"Apprenant",5,"N&P Apprenant 5",{"$f":"Activité1!F$35","v":"Note"},{"$f":"Activité2!F$35","v":"Note"},{"$f":"Activité3!F$35","v":"Note"},{"$error":"#VALUE!"},{"$error":"#VALUE!"},{"$error":"#VALUE!"}]
["Titre épreuve 2","Titre activité 2",null,null,null,null,1,null,"Apprenant",6,"N&P Apprenant 6",{"$f":"Activité1!G$35","v":"Note"},{"$f":"Activité2!G$35","v":"Note"},{"$f":"Activité3!G$35","v":"Note"},{"$error":"#VALUE!"},{"$error":"#VALUE!"},{"$error":"#VALUE!"}]
["Titre épreuve 3","Titre activité 3",null,null,null,null,1,null,"Apprenant",7,"N&P Apprenant 7",{"$f":"Activité1!H$35","v":"Note"},{"$f":"Activité2!H$35","v":"Note"},{"$f":"Activité3!H$35","v":"Note"},{"$error":"#VALUE!"},{"$error":"#VALUE!"},{"$error":"#VALUE!"}]
[null,null,null,null,null,null,null,null,"Apprenant",8,"N&P Apprenant 8",{"$f":"Activité1!I$35","v":"Note"},{"$f":"Activité2!I$35","v":"Note"},{"$f":"Activité3!I$35","v":"Note"},{"$error":"#VALUE!"},{"$error":"#VALUE!"},{"$error":"#VALUE!"}]
["Feuilles Activités 1, 2 et 3",null,null,null,null,null,null,null,"Apprenant",9,"N&P Apprenant 9",{"$f":"Activité1!J$35","v":"Note"},{"$f":"Activité2!J$35","v":"Note"},{"$f":"Activité3!J$35","v":"Note"},{"$error":"#VALUE!"},{"$error":"#VALUE!"},{"$error":"#VALUE!"}]
[null,null,null,null,null,null,null,null,"Apprenant",10,"N&P Apprenant 10",{"$f":"Activité1!K$35","v":"Note"},{"$f":"Activité2!K$35","v":"Note"},{"$f":"Activité3!K$35","v":"Note"},{"$error":"#VALUE!"},{"$error":"#VALUE!"},{"$error":"#VALUE!"}]
["Seules les cellules grises sont à compléter en plaçant :",null,null,null,null,null,null,null,"Apprenant",11,"N&P Apprenant 11",{"$f":"Activité1!L$35","v":"Note"},{"$f":"Activité2!L$35","v":"Note"},{"$f":"Activité3!L$35","v":"Note"},{"$error":"#VALUE!"},{"$error":"#VALUE!"},{"$error":"#VALUE!"}]
[null,null,null,null,null,null,null,null,"Apprenant",12,"N&P Apprenant 12",{"$f":"Activité1!M$35","v":"Note"},{"$f":"Activité2!M$35","v":"Note"},{"$f":"Activité3!M$35","v":"Note"},{"$error":"#VALUE!"},{"$error":"#VALUE!"},{"$error":"#VALUE!"}]
["1) une valeur entre 0, 1, 2, 3 et 4",null,null,null,"dans les cellules avec un ",null,0,null,null,null,"Moyenne",{"$f":"AVERAGE(L3:L14)","v":{"$error":"#DIV/0!"}},{"$f":"AVERAGE(M3:M14)","v":{"$error":"#DIV/0!"}},{"$f":"AVERAGE(N3:N14)","v":{"$error":"#DIV/0!"}},{"$f":"AVERAGE(O3:O14)","v":{"$error":"#VALUE!"}},{"$error":"#VALUE!"},{"$error":"#VALUE!"}]
[null,null,null,null,null,null,null,null,null,null,"Max",{"$f":"MAX(L3:L14)","v":0},{"$f":"MAX(M3:M14)","v":0},{"$f":"MAX(N3:N14)","v":0},{"$f":"MAX(O3:O14)","v":{"$error":"#VALUE!"}},{"$error":"#VALUE!"},{"$error":"#VALUE!"}]
["2) la note en points entiers ou 0,5 points",null,null,null,"dans les cellules avec un ",null,"Note",null,null,null,"Min",{"$f":"MIN(L3:L14)","v":0},{"$f":"MIN(M3:M14)","v":0},{"$f":"MIN(N3:N14)","v":0},{"$f":"MIN(O3:O14)","v":{"$error":"#VALUE!"}},{"$error":"#VALUE!"},{"$error":"#VALUE!"}]
[null,null,null,null,null,null,null,null,null,null,"Ecart type",{"$f":"STDEV(L3:L14)","v":{"$error":"#DIV/0!"}},{"$f":"STDEV(M3:M14)","v":{"$error":"#DIV/0!"}},{"$f":"STDEV(N3:N14)","v":{"$error":"#DIV/0!"}},{"$f":"STDEV(O3:O14)","v":{"$error":"#VALUE!"}},{"$error":"#VALUE!"},{"$error":"#VALUE!"}]
["Les onglets sont à dupliquer en fonction du nombre de candidats"]
[]
[]
[]
[]
[]
[null,"Avant d'imprimer, veuillez définir votre imprimante \"Par défaut\" dans "]
[null,"les paramètres d'impression de votre ordinateur."]
[null,"Il est conseillé de sélectionner une imprimante PDF pour visualiser les"]
[null,"tableaux avant impression."]
[null,"Pour des impressions à l'unité, veuillez procéder comme pour une"]
[null,"impression habituelle."]

{"sheet":"Activité1","index":1,"n_rows":37,"n_cols":13,"rows_kept":37,"cut":false,"hidden":false,"merged":[[1,1,1,4],[2,1,2,4]]}
["Etablissement ",{"$f":"IF(ISBLANK(Présentation!B4),\"\",Présentation!B4)","v":"Nom de l'établissement"},null,null,null,null,null,"Codes à saisir >",0,1,2,3,4]
["Diplôme",{"$f":"IF(ISBLANK(Présentation!B5),\"\",Présentation!B5)","v":"Seconde professionnelle [F] MHR"},null,null,null,null,null,"Signification","Non fait","Non maîtrisé","Insuffisamment maîtrisé","Maîtrise satisfaisante","Très bonne maîtrise"]
["Activité ",{"$f":"IF(ISBLANK(Présentation!B7),\"\",Présentation!B7)","v":"Titre activité 1"},null,null,null,null,null,"Indication visuelle",0,1,2,3,4]
["Coefficient",{"$f":"IF(ISBLANK(Présentation!G7),\"\",Présentation!G7)","v":1}]
[]
["Nom des apprenants",{"$f":"IF(ISBLANK(Présentation!$K3),\"\",Présentation!$K3)","v":"N&P Apprenant 1"},{"$f":"IF(ISBLANK(Présentation!$K4),\"\",Présentation!$K4)","v":"N&P Apprenant 2"},{"$f":"IF(ISBLANK(Présentation!$K5),\"\",Présentation!$K5)","v":"N&P Apprenant 3"},{"$f":"IF(ISBLANK(Présentation!$K6),\"\",Présentation!$K6)","v":"N&P Apprenant 4"},{"$f":"IF(ISBLANK(Présentation!$K7),\"\",Présentation!$K7)","v":"N&P Apprenant 5"},{"$f":"IF(ISBLANK(Présentation!$K8),\"\",Présentation!$K8)","v":"N&P Apprenant 6"},{"$f":"IF(ISBLANK(Présentation!$K9),\"\",Présentation!$K9)","v":"N&P Apprenant 7"},{"$f":"IF(ISBLANK(Présentation!$K10),\"\",Présentation!$K10)","v":"N&P Apprenant 8"},{"$f":"IF(ISBLANK(Présentation!$K11),\"\",Présentation!$K11)","v":"N&P Apprenant 9"},{"$f":"IF(ISBLANK(Présentation!$K12),\"\",Présentation!$K12)","v":"N&P Apprenant 10"},{"$f":"IF(ISBLANK(Présentation!$K13),\"\",Présentation!$K13)","v":"N&P Apprenant 11"},{"$f":"IF(ISBLANK(Présentation!$K13),\"\",Présentation!$K13)","v":"N&P Apprenant 11"}]
[]
["Act1 - Compétence 1 sur trois lignes pour impression",0,0,0,0,0,0,0,0,0,0,0,0]
["Act1 - Compétence 2",0,0,0,0,0,0,0,0,0,0,0,0]
["Act1 - Compétence 3",0,0,0,0,0,0,0,0,0,0,0,0]
["Act1 - Compétence 4",0,0,0,0,0,0,0,0,0,0,0,0]
["Act1 - Compétence 5",0,0,0,0,0,0,0,0,0,0,0,0]
["Act1 - Compétence 6",0,0,0,0,0,0,0,0,0,0,0,0]
["Act1 - Compétence 7",0,0,0,0,0,0,0,0,0,0,0,0]
["Act1 - Compétence 8",0,0,0,0,0,0,0,0,0,0,0,0]
["Act1 - Compétence 9",0,0,0,0,0,0,0,0,0,0,0,0]
["Act1 - Compétence 10",0,0,0,0,0,0,0,0,0,0,0,0]
["Act1 - Compétence 11",0,0,0,0,0,0,0,0,0,0,0,0]
["Act1 - Compétence 12",0,0,0,0,0,0,0,0,0,0,0,0]
["Act1 - Compétence 13",0,0,0,0,0,0,0,0,0,0,0,0]
["Act1 - Compétence 14",0,0,0,0,0,0,0,0,0,0,0,0]
["Act1 - Compétence 15",0,0,0,0,0,0,0,0,0,0,0,0]
["Act1 - Compétence 16",0,0,0,0,0,0,0,0,0,0,0,0]
["Act1 - Compétence 17",0,0,0,0,0,0,0,0,0,0,0,0]
["Act1 - Compétence 18",0,0,0,0,0,0,0,0,0,0,0,0]
["Act1 - Compétence 19",0,0,0,0,0,0,0,0,0,0,0,0]
["Act1 - Compétence 20",0,0,0,0,0,0,0,0,0,0,0,0]
["Act1 - Compétence 21",0,0,0,0,0,0,0,0,0,0,0,0]
["Act1 - Compétence 22",0,0,0,0,0,0,0,0,0,0,0,0]
["Act1 - Compétence 23",0,0,0,0,0,0,0,0,0,0,0,0]
["Act1 - Compétence 24",0,0,0,0,0,0,0,0,0,0,0,0]
["Act1 - Compétence 25",0,0,0,0,0,0,0,0,0,0,0,0]
[]
[]
["Note proposée sur 20 (0,5 pts)","Note","Note","Note","Note","Note","Note","Note","Note","Note","Note","Note","Note"]
[]
["Note avec coef",{"$f":"IF(B35=\"Note\",\"\",B35*$B$4)","v":""},{"$f":"IF(C35=\"Note\",\"\",C35*$B$4)","v":""},"","","","","","","","","",""]

{"sheet":"Activité2","index":2,"n_rows":37,"n_cols":13,"rows_kept":37,"cut":false,"hidden":false,"merged":[[1,1,1,4],[2,1,2,4]]}
["Etablissement ",{"$f":"IF(ISBLANK(Présentation!B4),\"\",Présentation!B4)","v":"Nom de l'établissement"},null,null,null,null,null,"Codes à saisir >",0,1,2,3,4]
["Diplôme",{"$f":"IF(ISBLANK(Présentation!B5),\"\",Présentation!B5)","v":"Seconde professionnelle [F] MHR"},null,null,null,null,null,"Signification","Non fait","Non maîtrisé","Insuffisamment maîtrisé","Maîtrise satisfaisante","Très bonne maîtrise"]
["Activité",{"$f":"IF(ISBLANK(Présentation!B8),\"\",Présentation!B8)","v":"Titre activité 2"},null,null,null,null,null,"Indication visuelle",0,1,2,3,4]
["Coefficient",{"$f":"IF(ISBLANK(Présentation!G8),\"\",Présentation!G8)","v":1}]
[]
["Nom des apprenants",{"$f":"IF(ISBLANK(Présentation!$K3),\"\",Présentation!$K3)","v":"N&P Apprenant 1"},{"$f":"IF(ISBLANK(Présentation!$K4),\"\",Présentation!$K4)","v":"N&P Apprenant 2"},{"$f":"IF(ISBLANK(Présentation!$K5),\"\",Présentation!$K5)","v":"N&P Apprenant 3"},{"$f":"IF(ISBLANK(Présentation!$K6),\"\",Présentation!$K6)","v":"N&P Apprenant 4"},{"$f":"IF(ISBLANK(Présentation!$K7),\"\",Présentation!$K7)","v":"N&P Apprenant 5"},{"$f":"IF(ISBLANK(Présentation!$K8),\"\",Présentation!$K8)","v":"N&P Apprenant 6"},{"$f":"IF(ISBLANK(Présentation!$K9),\"\",Présentation!$K9)","v":"N&P Apprenant 7"},{"$f":"IF(ISBLANK(Présentation!$K10),\"\",Présentation!$K10)","v":"N&P Apprenant 8"},{"$f":"IF(ISBLANK(Présentation!$K11),\"\",Présentation!$K11)","v":"N&P Apprenant 9"},{"$f":"IF(ISBLANK(Présentation!$K12),\"\",Présentation!$K12)","v":"N&P Apprenant 10"},{"$f":"IF(ISBLANK(Présentation!$K13),\"\",Présentation!$K13)","v":"N&P Apprenant 11"},{"$f":"IF(ISBLANK(Présentation!$K13),\"\",Présentation!$K13)","v":"N&P Apprenant 11"}]
[]
["Act2 - Compétence 1 sur trois lignes pour impression",0,0,0,0,0,0,0,0,0,0,0,0]
["Act2 - Compétence 2",0,0,0,0,0,0,0,0,0,0,0,0]
["Act2 - Compétence 3",0,0,0,0,0,0,0,0,0,0,0,0]
["Act2 - Compétence 4",0,0,0,0,0,0,0,0,0,0,0,0]
["Act2 - Compétence 5",0,0,0,0,0,0,0,0,0,0,0,0]
["Act2 - Compétence 6",0,0,0,0,0,0,0,0,0,0,0,0]
["Act2 - Compétence 7",0,0,0,0,0,0,0,0,0,0,0,0]
["Act2 - Compétence 8",0,0,0,0,0,0,0,0,0,0,0,0]
["Act2 - Compétence 9",0,0,0,0,0,0,0,0,0,0,0,0]
["Act2 - Compétence 10",0,0,0,0,0,0,0,0,0,0,0,0]
["Act2 - Compétence 11",0,0,0,0,0,0,0,0,0,0,0,0]
["Act2 - Compétence 12",0,0,0,0,0,0,0,0,0,0,0,0]
["Act2 - Compétence 13",0,0,0,0,0,0,0,0,0,0,0,0]
["Act2 - Compétence 14",0,0,0,0,0,0,0,0,0,0,0,0]
["Act2 - Compétence 15",0,0,0,0,0,0,0,0,0,0,0,0]
["Act2 - Compétence 16",0,0,0,0,0,0,0,0,0,0,0,0]
["Act2 - Compétence 17",0,0,0,0,0,0,0,0,0,0,0,0]
["Act2 - Compétence 18",0,0,0,0,0,0,0,0,0,0,0,0]
["Act2 - Compétence 19",0,0,0,0,0,0,0,0,0,0,0,0]
["Act2 - Compétence 20",0,0,0,0,0,0,0,0,0,0,0,0]
["Act2 - Compétence 21",0,0,0,0,0,0,0,0,0,0,0,0]
["Act2 - Compétence 22",0,0,0,0,0,0,0,0,0,0,0,0]
["Act2 - Compétence 23",0,0,0,0,0,0,0,0,0,0,0,0]
["Act2 - Compétence 24",0,0,0,0,0,0,0,0,0,0,0,0]
["Act2 - Compétence 25",0,0,0,0,0,0,0,0,0,0,0,0]
[]
[]
["Note proposée sur 20 (0,5 pts)","Note","Note","Note","Note","Note","Note","Note","Note","Note","Note","Note","Note"]
[]
["Note avec coef",{"$f":"IF(B35=\"Note\",\"\",B35*$B$4)","v":""},{"$f":"IF(C35=\"Note\",\"\",C35*$B$4)","v":""},"","","","","","","","","",""]

{"sheet":"Activité3","index":3,"n_rows":37,"n_cols":13,"rows_kept":37,"cut":false,"hidden":false,"merged":[[1,1,1,4],[2,1,2,4]]}
["Etablissement ",{"$f":"IF(ISBLANK(Présentation!B4),\"\",Présentation!B4)","v":"Nom de l'établissement"},null,null,null,null,null,"Codes à saisir >",0,1,2,3,4]
["Diplôme",{"$f":"IF(ISBLANK(Présentation!B5),\"\",Présentation!B5)","v":"Seconde professionnelle [F] MHR"},null,null,null,null,null,"Signification","Non fait","Non maîtrisé","Insuffisamment maîtrisé","Maîtrise satisfaisante","Très bonne maîtrise"]
["Activité",{"$f":"IF(ISBLANK(Présentation!B9),\"\",Présentation!B9)","v":"Titre activité 3"},null,null,null,null,null,"Indication visuelle",0,1,2,3,4]
["Coefficient",{"$f":"IF(ISBLANK(Présentation!G9),\"\",Présentation!G9)","v":1}]
[]
["Nom des apprenants",{"$f":"IF(ISBLANK(Présentation!$K3),\"\",Présentation!$K3)","v":"N&P Apprenant 1"},{"$f":"IF(ISBLANK(Présentation!$K4),\"\",Présentation!$K4)","v":"N&P Apprenant 2"},{"$f":"IF(ISBLANK(Présentation!$K5),\"\",Présentation!$K5)","v":"N&P Apprenant 3"},{"$f":"IF(ISBLANK(Présentation!$K6),\"\",Présentation!$K6)","v":"N&P Apprenant 4"},{"$f":"IF(ISBLANK(Présentation!$K7),\"\",Présentation!$K7)","v":"N&P Apprenant 5"},{"$f":"IF(ISBLANK(Présentation!$K8),\"\",Présentation!$K8)","v":"N&P Apprenant 6"},{"$f":"IF(ISBLANK(Présentation!$K9),\"\",Présentation!$K9)","v":"N&P Apprenant 7"},{"$f":"IF(ISBLANK(Présentation!$K10),\"\",Présentation!$K10)","v":"N&P Apprenant 8"},{"$f":"IF(ISBLANK(Présentation!$K11),\"\",Présentation!$K11)","v":"N&P Apprenant 9"},{"$f":"IF(ISBLANK(Présentation!$K12),\"\",Présentation!$K12)","v":"N&P Apprenant 10"},{"$f":"IF(ISBLANK(Présentation!$K13),\"\",Présentation!$K13)","v":"N&P Apprenant 11"},{"$f":"IF(ISBLANK(Présentation!$K13),\"\",Présentation!$K13)","v":"N&P Apprenant 11"}]
[]
["Act3 - Compétence 1 sur trois lignes pour impression",0,0,0,0,0,0,0,0,0,0,0,0]
["Act3 - Compétence 2",0,0,0,0,0,0,0,0,0,0,0,0]
["Act3 - Compétence 3",0,0,0,0,0,0,0,0,0,0,0,0]
["Act3 - Compétence 4",0,0,0,0,0,0,0,0,0,0,0,0]
["Act3 - Compétence 5",0,0,0,0,0,0,0,0,0,0,0,0]
["Act3 - Compétence 6",0,0,0,0,0,0,0,0,0,0,0,0]
["Act3 - Compétence 7",0,0,0,0,0,0,0,0,0,0,0,0]
["Act3 - Compétence 8",0,0,0,0,0,0,0,0,0,0,0,0]
["Act3 - Compétence 9",0,0,0,0,0,0,0,0,0,0,0,0]
["Act3 - Compétence 10",0,0,0,0,0,0,0,0,0,0,0,0]
["Act3 - Compétence 11",0,0,0,0,0,0,0,0,0,0,0,0]
["Act3 - Compétence 12",0,0,0,0,0,0,0,0,0,0,0,0]
["Act3 - Compétence 13",0,0,0,0,0,0,0,0,0,0,0,0]
["Act3 - Compétence 14",0,0,0,0,0,0,0,0,0,0,0,0]
["Act3 - Compétence 15",0,0,0,0,0,0,0,0,0,0,0,0]
["Act3 - Compétence 16",0,0,0,0,0,0,0,0,0,0,0,0]
["Act3 - Compétence 17",0,0,0,0,0,0,0,0,0,0,0,0]
["Act3 - Compétence 18",0,0,0,0,0,0,0,0,0,0,0,0]
["Act3 - Compétence 19",0,0,0,0,0,0,0,0,0,0,0,0]
["Act3 - Compétence 20",0,0,0,0,0,0,0,0,0,0,0,0]
["Act3 - Compétence 21",0,0,0,0,0,0,0,0,0,0,0,0]
["Act3 - Compétence 22",0,0,0,0,0,0,0,0,0,0,0,0]
["Act3 - Compétence 23",0,0,0,0,0,0,0,0,0,0,0,0]
["Act3 - Compétence 24",0,0,0,0,0,0,0,0,0,0,0,0]
["Act3 - Compétence 25",0,0,0,0,0,0,0,0,0,0,0,0]
[]
[]
["Note proposée sur 20 (0,5 pts)","Note","Note","Note","Note","Note","Note","Note","Note","Note","Note","Note","Note"]
[]
["Note avec coef",{"$f":"IF(B35=\"Note\",\"\",B35*$B$4)","v":""},{"$f":"IF(C35=\"Note\",\"\",C35*$B$4)","v":""},"","","","","","","","","",""]

{"sheet":"FicheApp01","index":4,"n_rows":37,"n_cols":13,"rows_kept":37,"cut":false,"hidden":false,"merged":[[27,8,27,11],[28,8,28,11],[29,8,29,11],[30,8,30,11],[31,8,31,11],[26,8,26,11],[15,8,15,11],[16,8,16,11],[17,8,17,11],[18,8,18,11],[19,8,19,11],[20,8,20,11],[21,8,21,11],[22,8,22,11],[23,8,23,11],[24,8,24,11],[25,8,25,11],[29,3,29,6],[30,3,30,6],[31,3,31,6],[8,8,8,11],[9,8,9,11],[10,8,10,11],[11,8,11,11],[12,8,12,11],[13,8,13,11],[14,8,14,11],[21,3,21,6],[22,3,22,6],[23,3,23,6],[24,3,24,6],[25,3,25,6],[26,3,26,6],[7,8,7,11],[5,0,6,2],[5,3,6,6],[4,0,4,2],[4,3,4,7],[4,8,4,12],[5,8,6,12],[31,0,31,1],[20,0,20,1],[21,0,21,1],[22,0,22,1],[23,0,23,1],[24,0,24,1],[25,0,25,1],[26,0,26,1],[27,0,27,1],[28,0,28,1],[29,0,29,1],[30,0,30,1],[19,0,19,1],[7,0,7,1],[8,0,8,1],[9,0,9,1],[10,0,10,1],[11,0,11,1],[12,0,12,1],[13,0,13,1],[14,0,14,1],[15,0,15,1],[16,0,16,1],[17,0,17,1],[18,0,18,1],[27,3,27,6],[28,3,28,6],[17,3,17,6],[18,3,18,6],[19,3,19,6],[20,3,20,6],[14,3,14,6],[15,3,15,6],[16,3,16,6],[1,1,1,4],[2,1,2,4],[7,3,7,6],[13,3,13,6],[8,3,8,6],[9,3,9,6],[10,3,10,6],[11,3,11,6],[12,3,12,6]]}
["Etablissement ",{"$f":"IF(ISBLANK(Présentation!B4),\"\",Présentation!B4)","v":"Nom de l'établissement"},null,null,null,null,null,"Codes à saisir >",0,1,2,3,4]
["Diplôme",{"$f":"IF(ISBLANK(Présentation!B5),\"\",Présentation!B5)","v":"Seconde professionnelle [F] MHR"},null,null,null,null,null,"Signification","Non fait","Non maîtrisé","Insuffisamment maîtrisé","Maîtrise satisfaisante","Très bonne maîtrise"]
["Nom de l'apprenant",{"$f":"IF(ISBLANK(Présentation!$K3),\"\",Présentation!$K3)","v":"N&P Apprenant 1"},null,null,null,null,null,"Indication visuelle",0,1,2,3,4]
[]
["Epreuve 1",null,null,"Epreuve 2",null,null,null,null,"Epreuve 3"]
[{"$f":"(IF(ISBLANK(Présentation!B7),\"\",Présentation!B7))","v":"Titre activité 1"},null,null,{"$f":"IF(ISBLANK(Présentation!B8),\"\",Présentation!B8)","v":"Titre activité 2"},null,null,null,null,{"$f":"IF(ISBLANK(Présentation!B9),\"\",Présentation!B9)","v":"Titre activité 3"}]
[]
[{"$f":"Activité1!A8","v":"Act1 - Compétence 1 sur trois lignes pour impression"},null,{"$f":"Activité1!B8","v":0},{"$f":"Activité2!A8","v":"Act2 - Compétence 1 sur trois lignes pour impression"},null,null,null,{"$f":"Activité2!B8","v":0},{"$f":"Activité3!A8","v":"Act3 - Compétence 1 sur trois lignes pour impression"},null,null,null,{"$f":"Activité3!B8","v":0}]
[{"$f":"Activité1!A9","v":"Act1 - Compétence 2"},null,{"$f":"Activité1!B9","v":0},{"$f":"Activité2!A9","v":"Act2 - Compétence 2"},null,null,null,{"$f":"Activité2!B9","v":0},{"$f":"Activité3!A9","v":"Act3 - Compétence 2"},null,null,null,{"$f":"Activité3!B9","v":0}]
[{"$f":"Activité1!A10","v":"Act1 - Compétence 3"},null,{"$f":"Activité1!B10","v":0},{"$f":"Activité2!A10","v":"Act2 - Compétence 3"},null,null,null,{"$f":"Activité2!B10","v":0},{"$f":"Activité3!A10","v":"Act3 - Compétence 3"},null,null,null,{"$f":"Activité3!B10","v":0}]
[{"$f":"Activité1!A11","v":"Act1 - Compétence 4"},null,{"$f":"Activité1!B11","v":0},{"$f":"Activité2!A11","v":"Act2 - Compétence 4"},null,null,null,{"$f":"Activité2!B11","v":0},{"$f":"Activité3!A11","v":"Act3 - Compétence 4"},null,null,null,{"$f":"Activité3!B11","v":0}]
[{"$f":"Activité1!A12","v":"Act1 - Compétence 5"},null,{"$f":"Activité1!B12","v":0},{"$f":"Activité2!A12","v":"Act2 - Compétence 5"},null,null,null,{"$f":"Activité2!B12","v":0},{"$f":"Activité3!A12","v":"Act3 - Compétence 5"},null,null,null,{"$f":"Activité3!B12","v":0}]
[{"$f":"Activité1!A13","v":"Act1 - Compétence 6"},null,{"$f":"Activité1!B13","v":0},{"$f":"Activité2!A13","v":"Act2 - Compétence 6"},null,null,null,{"$f":"Activité2!B13","v":0},{"$f":"Activité3!A13","v":"Act3 - Compétence 6"},null,null,null,{"$f":"Activité3!B13","v":0}]
[{"$f":"Activité1!A14","v":"Act1 - Compétence 7"},null,{"$f":"Activité1!B14","v":0},{"$f":"Activité2!A14","v":"Act2 - Compétence 7"},null,null,null,{"$f":"Activité2!B14","v":0},{"$f":"Activité3!A14","v":"Act3 - Compétence 7"},null,null,null,{"$f":"Activité3!B14","v":0}]
[{"$f":"Activité1!A15","v":"Act1 - Compétence 8"},null,{"$f":"Activité1!B15","v":0},{"$f":"Activité2!A15","v":"Act2 - Compétence 8"},null,null,null,{"$f":"Activité2!B15","v":0},{"$f":"Activité3!A15","v":"Act3 - Compétence 8"},null,null,null,{"$f":"Activité3!B15","v":0}]
[{"$f":"Activité1!A16","v":"Act1 - Compétence 9"},null,{"$f":"Activité1!B16","v":0},{"$f":"Activité2!A16","v":"Act2 - Compétence 9"},null,null,null,{"$f":"Activité2!B16","v":0},{"$f":"Activité3!A16","v":"Act3 - Compétence 9"},null,null,null,{"$f":"Activité3!B16","v":0}]
[{"$f":"Activité1!A17","v":"Act1 - Compétence 10"},null,{"$f":"Activité1!B17","v":0},{"$f":"Activité2!A17","v":"Act2 - Compétence 10"},null,null,null,{"$f":"Activité2!B17","v":0},{"$f":"Activité3!A17","v":"Act3 - Compétence 10"},null,null,null,{"$f":"Activité3!B17","v":0}]
[{"$f":"Activité1!A18","v":"Act1 - Compétence 11"},null,{"$f":"Activité1!B18","v":0},{"$f":"Activité2!A18","v":"Act2 - Compétence 11"},null,null,null,{"$f":"Activité2!B18","v":0},{"$f":"Activité3!A18","v":"Act3 - Compétence 11"},null,null,null,{"$f":"Activité3!B18","v":0}]
[{"$f":"Activité1!A19","v":"Act1 - Compétence 12"},null,{"$f":"Activité1!B19","v":0},{"$f":"Activité2!A19","v":"Act2 - Compétence 12"},null,null,null,{"$f":"Activité2!B19","v":0},{"$f":"Activité3!A19","v":"Act3 - Compétence 12"},null,null,null,{"$f":"Activité3!B19","v":0}]
[{"$f":"Activité1!A20","v":"Act1 - Compétence 13"},null,{"$f":"Activité1!B20","v":0},{"$f":"Activité2!A20","v":"Act2 - Compétence 13"},null,null,null,{"$f":"Activité2!B20","v":0},{"$f":"Activité3!A20","v":"Act3 - Compétence 13"},null,null,null,{"$f":"Activité3!B20","v":0}]
[{"$f":"Activité1!A21","v":"Act1 - Compétence 14"},null,{"$f":"Activité1!B21","v":0},{"$f":"Activité2!A21","v":"Act2 - Compétence 14"},null,null,null,{"$f":"Activité2!B21","v":0},{"$f":"Activité3!A21","v":"Act3 - Compétence 14"},null,null,null,{"$f":"Activité3!B21","v":0}]
[{"$f":"Activité1!A22","v":"Act1 - Compétence 15"},null,{"$f":"Activité1!B22","v":0},{"$f":"Activité2!A22","v":"Act2 - Compétence 15"},null,null,null,{"$f":"Activité2!B22","v":0},{"$f":"Activité3!A22","v":"Act3 - Compétence 15"},null,null,null,{"$f":"Activité3!B22","v":0}]
[{"$f":"Activité1!A23","v":"Act1 - Compétence 16"},null,{"$f":"Activité1!B23","v":0},{"$f":"Activité2!A23","v":"Act2 - Compétence 16"},null,null,null,{"$f":"Activité2!B23","v":0},{"$f":"Activité3!A23","v":"Act3 - Compétence 16"},null,null,null,{"$f":"Activité3!B23","v":0}]
[{"$f":"Activité1!A24","v":"Act1 - Compétence 17"},null,{"$f":"Activité1!B24","v":0},{"$f":"Activité2!A24","v":"Act2 - Compétence 17"},null,null,null,{"$f":"Activité2!B24","v":0},{"$f":"Activité3!A24","v":"Act3 - Compétence 17"},null,null,null,{"$f":"Activité3!B24","v":0}]
[{"$f":"Activité1!A25","v":"Act1 - Compétence 18"},null,{"$f":"Activité1!B25","v":0},{"$f":"Activité2!A25","v":"Act2 - Compétence 18"},null,null,null,{"$f":"Activité2!B25","v":0},{"$f":"Activité3!A25","v":"Act3 - Compétence 18"},null,null,null,{"$f":"Activité3!B25","v":0}]
[{"$f":"Activité1!A26","v":"Act1 - Compétence 19"},null,{"$f":"Activité1!B26","v":0},{"$f":"Activité2!A26","v":"Act2 - Compétence 19"},null,null,null,{"$f":"Activité2!B26","v":0},{"$f":"Activité3!A26","v":"Act3 - Compétence 19"},null,null,null,{"$f":"Activité3!B26","v":0}]
[{"$f":"Activité1!A27","v":"Act1 - Compétence 20"},null,{"$f":"Activité1!B27","v":0},{"$f":"Activité2!A27","v":"Act2 - Compétence 20"},null,null,null,{"$f":"Activité2!B27","v":0},{"$f":"Activité3!A27","v":"Act3 - Compétence 20"},null,null,null,{"$f":"Activité3!B27","v":0}]
[{"$f":"Activité1!A28","v":"Act1 - Compétence 21"},null,{"$f":"Activité1!B28","v":0},{"$f":"Activité2!A28","v":"Act2 - Compétence 21"},null,null,null,{"$f":"Activité2!B28","v":0},{"$f":"Activité3!A28","v":"Act3 - Compétence 21"},null,null,null,{"$f":"Activité3!B28","v":0}]
[{"$f":"Activité1!A29","v":"Act1 - Compétence 22"},null,{"$f":"Activité1!B29","v":0},{"$f":"Activité2!A29","v":"Act2 - Compétence 22"},null,null,null,{"$f":"Activité2!B29","v":0},{"$f":"Activité3!A29","v":"Act3 - Compétence 22"},null,null,null,{"$f":"Activité3!B29","v":0}]
[{"$f":"Activité1!A30","v":"Act1 - Compétence 23"},null,{"$f":"Activité1!B30","v":0},{"$f":"Activité2!A30","v":"Act2 - Compétence 23"},null,null,null,{"$f":"Activité2!B30","v":0},{"$f":"Activité3!A30","v":"Act3 - Compétence 23"},null,null,null,{"$f":"Activité3!B30","v":0}]
[{"$f":"Activité1!A31","v":"Act1 - Compétence 24"},null,{"$f":"Activité1!B31","v":0},{"$f":"Activité2!A31","v":"Act2 - Compétence 24"},null,null,null,{"$f":"Activité2!B31","v":0},{"$f":"Activité3!A31","v":"Act3 - Compétence 24"},null,null,null,{"$f":"Activité3!B31","v":0}]
[{"$f":"Activité1!A32","v":"Act1 - Compétence 25"},null,{"$f":"Activité1!B32","v":0},{"$f":"Activité2!A32","v":"Act2 - Compétence 25"},null,null,null,{"$f":"Activité2!B32","v":0},{"$f":"Activité3!A32","v":"Act3 - Compétence 25"},null,null,null,{"$f":"Activité3!B32","v":0}]
[]
[]
["Note proposée sur 20 (0,5 pts)",null,{"$f":"Activité1!B35","v":"Note"},null,null,null,null,{"$f":"Activité2!B35","v":"Note"},null,null,null,null,{"$f":"Activité3!B35","v":"Note"}]
[]
["Note avec coef",null,{"$f":"Activité1!B37","v":""},null,null,null,null,{"$f":"Activité2!B37","v":""},null,null,null,null,{"$f":"Activité3!B37","v":""}]

{"sheet":"FicheApp02","index":5,"n_rows":37,"n_cols":13,"rows_kept":37,"cut":false,"hidden":false,"merged":[[31,0,31,1],[31,3,31,6],[31,8,31,11],[29,0,29,1],[29,3,29,6],[29,8,29,11],[30,0,30,1],[30,3,30,6],[30,8,30,11],[27,0,27,1],[27,3,27,6],[27,8,27,11],[28,0,28,1],[28,3,28,6],[28,8,28,11],[25,0,25,1],[25,3,25,6],[25,8,25,11],[26,0,26,1],[26,3,26,6],[26,8,26,11],[23,0,23,1],[23,3,23,6],[23,8,23,11],[24,0,24,1],[24,3,24,6],[24,8,24,11],[21,0,21,1],[21,3,21,6],[21,8,21,11],[22,0,22,1],[22,3,22,6],[22,8,22,11],[19,0,19,1],[19,3,19,6],[19,8,19,11],[20,0,20,1],[20,3,20,6],[20,8,20,11],[17,0,17,1],[17,3,17,6],[17,8,17,11],[18,0,18,1],[18,3,18,6],[18,8,18,11],[15,0,15,1],[15,3,15,6],[15,8,15,11],[16,0,16,1],[16,3,16,6],[16,8,16,11],[13,0,13,1],[13,3,13,6],[13,8,13,11],[14,0,14,1],[14,3,14,6],[14,8,14,11],[11,0,11,1],[11,3,11,6],[11,8,11,11],[12,0,12,1],[12,3,12,6],[12,8,12,11],[9,0,9,1],[9,3,9,6],[9,8,9,11],[10,0,10,1],[10,3,10,6],[10,8,10,11],[7,0,7,1],[7,3,7,6],[7,8,7,11],[8,0,8,1],[8,3,8,6],[8,8,8,11],[5,0,6,2],[5,3,6,6],[5,8,6,12],[1,1,1,4],[2,1,2,4],[4,0,4,2],[4,3,4,7],[4,8,4,12]]}
["Etablissement ",{"$f":"IF(ISBLANK(Présentation!B4),\"\",Présentation!B4)","v":"Nom de l'établissement"},null,null,null,null,null,"Codes à saisir >",0,1,2,3,4]
["Diplôme",{"$f":"IF(ISBLANK(Présentation!B5),\"\",Présentation!B5)","v":"Seconde professionnelle [F] MHR"},null,null,null,null,null,"Signification","Non fait","Non maîtrisé","Insuffisamment maîtrisé","Maîtrise satisfaisante","Très bonne maîtrise"]
["Nom de l'apprenant",{"$f":"IF(ISBLANK(Présentation!$K4),\"\",Présentation!$K4)","v":"N&P Apprenant 2"},null,null,null,null,null,"Indication visuelle",0,1,2,3,4]
[]
["Epreuve 1",null,null,"Epreuve 2",null,null,null,null,"Epreuve 3"]
[{"$f":"(IF(ISBLANK(Présentation!B7),\"\",Présentation!B7))","v":"Titre activité 1"},null,null,{"$f":"IF(ISBLANK(Présentation!B8),\"\",Présentation!B8)","v":"Titre activité 2"},null,null,null,null,{"$f":"IF(ISBLANK(Présentation!B9),\"\",Présentation!B9)","v":"Titre activité 3"}]
[]
[{"$f":"Activité1!A8","v":"Act1 - Compétence 1 sur trois lignes pour impression"},null,{"$f":"Activité1!C8","v":0},{"$f":"Activité2!A8","v":"Act2 - Compétence 1 sur trois lignes pour impression"},null,null,null,{"$f":"Activité2!C8","v":0},{"$f":"Activité3!A8","v":"Act3 - Compétence 1 sur trois lignes pour impression"},null,null,null,{"$f":"Activité3!C8","v":0}]
[{"$f":"Activité1!A9","v":"Act1 - Compétence 2"},null,{"$f":"Activité1!C9","v":0},{"$f":"Activité2!A9","v":"Act2 - Compétence 2"},null,null,null,{"$f":"Activité2!C9","v":0},{"$f":"Activité3!A9","v":"Act3 - Compétence 2"},null,null,null,{"$f":"Activité3!C9","v":0}]
[{"$f":"Activité1!A10","v":"Act1 - Compétence 3"},null,{"$f":"Activité1!C10","v":0},{"$f":"Activité2!A10","v":"Act2 - Compétence 3"},null,null,null,{"$f":"Activité2!C10","v":0},{"$f":"Activité3!A10","v":"Act3 - Compétence 3"},null,null,null,{"$f":"Activité3!C10","v":0}]
[{"$f":"Activité1!A11","v":"Act1 - Compétence 4"},null,{"$f":"Activité1!C11","v":0},{"$f":"Activité2!A11","v":"Act2 - Compétence 4"},null,null,null,{"$f":"Activité2!C11","v":0},{"$f":"Activité3!A11","v":"Act3 - Compétence 4"},null,null,null,{"$f":"Activité3!C11","v":0}]
[{"$f":"Activité1!A12","v":"Act1 - Compétence 5"},null,{"$f":"Activité1!C12","v":0},{"$f":"Activité2!A12","v":"Act2 - Compétence 5"},null,null,null,{"$f":"Activité2!C12","v":0},{"$f":"Activité3!A12","v":"Act3 - Compétence 5"},null,null,null,{"$f":"Activité3!C12","v":0}]
[{"$f":"Activité1!A13","v":"Act1 - Compétence 6"},null,{"$f":"Activité1!C13","v":0},{"$f":"Activité2!A13","v":"Act2 - Compétence 6"},null,null,null,{"$f":"Activité2!C13","v":0},{"$f":"Activité3!A13","v":"Act3 - Compétence 6"},null,null,null,{"$f":"Activité3!C13","v":0}]
[{"$f":"Activité1!A14","v":"Act1 - Compétence 7"},null,{"$f":"Activité1!C14","v":0},{"$f":"Activité2!A14","v":"Act2 - Compétence 7"},null,null,null,{"$f":"Activité2!C14","v":0},{"$f":"Activité3!A14","v":"Act3 - Compétence 7"},null,null,null,{"$f":"Activité3!C14","v":0}]
[{"$f":"Activité1!A15","v":"Act1 - Compétence 8"},null,{"$f":"Activité1!C15","v":0},{"$f":"Activité2!A15","v":"Act2 - Compétence 8"},null,null,null,{"$f":"Activité2!C15","v":0},{"$f":"Activité3!A15","v":"Act3 - Compétence 8"},null,null,null,{"$f":"Activité3!C15","v":0}]
[{"$f":"Activité1!A16","v":"Act1 - Compétence 9"},null,{"$f":"Activité1!C16","v":0},{"$f":"Activité2!A16","v":"Act2 - Compétence 9"},null,null,null,{"$f":"Activité2!C16","v":0},{"$f":"Activité3!A16","v":"Act3 - Compétence 9"},null,null,null,{"$f":"Activité3!C16","v":0}]
[{"$f":"Activité1!A17","v":"Act1 - Compétence 10"},null,{"$f":"Activité1!C17","v":0},{"$f":"Activité2!A17","v":"Act2 - Compétence 10"},null,null,null,{"$f":"Activité2!C17","v":0},{"$f":"Activité3!A17","v":"Act3 - Compétence 10"},null,null,null,{"$f":"Activité3!C17","v":0}]
[{"$f":"Activité1!A18","v":"Act1 - Compétence 11"},null,{"$f":"Activité1!C18","v":0},{"$f":"Activité2!A18","v":"Act2 - Compétence 11"},null,null,null,{"$f":"Activité2!C18","v":0},{"$f":"Activité3!A18","v":"Act3 - Compétence 11"},null,null,null,{"$f":"Activité3!C18","v":0}]
[{"$f":"Activité1!A19","v":"Act1 - Compétence 12"},null,{"$f":"Activité1!C19","v":0},{"$f":"Activité2!A19","v":"Act2 - Compétence 12"},null,null,null,{"$f":"Activité2!C19","v":0},{"$f":"Activité3!A19","v":"Act3 - Compétence 12"},null,null,null,{"$f":"Activité3!C19","v":0}]
[{"$f":"Activité1!A20","v":"Act1 - Compétence 13"},null,{"$f":"Activité1!C20","v":0},{"$f":"Activité2!A20","v":"Act2 - Compétence 13"},null,null,null,{"$f":"Activité2!C20","v":0},{"$f":"Activité3!A20","v":"Act3 - Compétence 13"},null,null,null,{"$f":"Activité3!C20","v":0}]
[{"$f":"Activité1!A21","v":"Act1 - Compétence 14"},null,{"$f":"Activité1!C21","v":0},{"$f":"Activité2!A21","v":"Act2 - Compétence 14"},null,null,null,{"$f":"Activité2!C21","v":0},{"$f":"Activité3!A21","v":"Act3 - Compétence 14"},null,null,null,{"$f":"Activité3!C21","v":0}]
[{"$f":"Activité1!A22","v":"Act1 - Compétence 15"},null,{"$f":"Activité1!C22","v":0},{"$f":"Activité2!A22","v":"Act2 - Compétence 15"},null,null,null,{"$f":"Activité2!C22","v":0},{"$f":"Activité3!A22","v":"Act3 - Compétence 15"},null,null,null,{"$f":"Activité3!C22","v":0}]
[{"$f":"Activité1!A23","v":"Act1 - Compétence 16"},null,{"$f":"Activité1!C23","v":0},{"$f":"Activité2!A23","v":"Act2 - Compétence 16"},null,null,null,{"$f":"Activité2!C23","v":0},{"$f":"Activité3!A23","v":"Act3 - Compétence 16"},null,null,null,{"$f":"Activité3!C23","v":0}]
[{"$f":"Activité1!A24","v":"Act1 - Compétence 17"},null,{"$f":"Activité1!C24","v":0},{"$f":"Activité2!A24","v":"Act2 - Compétence 17"},null,null,null,{"$f":"Activité2!C24","v":0},{"$f":"Activité3!A24","v":"Act3 - Compétence 17"},null,null,null,{"$f":"Activité3!C24","v":0}]
[{"$f":"Activité1!A25","v":"Act1 - Compétence 18"},null,{"$f":"Activité1!C25","v":0},{"$f":"Activité2!A25","v":"Act2 - Compétence 18"},null,null,null,{"$f":"Activité2!C25","v":0},{"$f":"Activité3!A25","v":"Act3 - Compétence 18"},null,null,null,{"$f":"Activité3!C25","v":0}]
[{"$f":"Activité1!A26","v":"Act1 - Compétence 19"},null,{"$f":"Activité1!C26","v":0},{"$f":"Activité2!A26","v":"Act2 - Compétence 19"},null,null,null,{"$f":"Activité2!C26","v":0},{"$f":"Activité3!A26","v":"Act3 - Compétence 19"},null,null,null,{"$f":"Activité3!C26","v":0}]
[{"$f":"Activité1!A27","v":"Act1 - Compétence 20"},null,{"$f":"Activité1!C27","v":0},{"$f":"Activité2!A27","v":"Act2 - Compétence 20"},null,null,null,{"$f":"Activité2!C27","v":0},{"$f":"Activité3!A27","v":"Act3 - Compétence 20"},null,null,null,{"$f":"Activité3!C27","v":0}]
[{"$f":"Activité1!A28","v":"Act1 - Compétence 21"},null,{"$f":"Activité1!C28","v":0},{"$f":"Activité2!A28","v":"Act2 - Compétence 21"},null,null,null,{"$f":"Activité2!C28","v":0},{"$f":"Activité3!A28","v":"Act3 - Compétence 21"},null,null,null,{"$f":"Activité3!C28","v":0}]
[{"$f":"Activité1!A29","v":"Act1 - Compétence 22"},null,{"$f":"Activité1!C29","v":0},{"$f":"Activité2!A29","v":"Act2 - Compétence 22"},null,null,null,{"$f":"Activité2!C29","v":0},{"$f":"Activité3!A29","v":"Act3 - Compétence 22"},null,null,null,{"$f":"Activité3!C29","v":0}]
[{"$f":"Activité1!A30","v":"Act1 - Compétence 23"},null,{"$f":"Activité1!C30","v":0},{"$f":"Activité2!A30","v":"Act2 - Compétence 23"},null,null,null,{"$f":"Activité2!C30","v":0},{"$f":"Activité3!A30","v":"Act3 - Compétence 23"},null,null,null,{"$f":"Activité3!C30","v":0}]
[{"$f":"Activité1!A31","v":"Act1 - Compétence 24"},null,{"$f":"Activité1!C31","v":0},{"$f":"Activité2!A31","v":"Act2 - Compétence 24"},null,null,null,{"$f":"Activité2!C31","v":0},{"$f":"Activité3!A31","v":"Act3 - Compétence 24"},null,null,null,{"$f":"Activité3!C31","v":0}]
[{"$f":"Activité1!A32","v":"Act1 - Compétence 25"},null,{"$f":"Activité1!C32","v":0},{"$f":"Activité2!A32","v":"Act2 - Compétence 25"},null,null,null,{"$f":"Activité2!C32","v":0},{"$f":"Activité3!A32","v":"Act3 - Compétence 25"},null,null,null,{"$f":"Activité3!C32","v":0}]
[]
[]
["Note proposée sur 20 (0,5 pts)",null,{"$f":"Activité1!C35","v":"Note"},null,null,null,null,{"$f":"Activité2!C35","v":"Note"},null,null,null,null,{"$f":"Activité3!C35","v":"Note"}]
[]
["Note avec coef",null,{"$f":"Activité1!C37","v":""},null,null,null,null,{"$f":"Activité2!C37","v":""},null,null,null,null,{"$f":"Activité3!C37","v":""}]

{"sheet":"FicheApp03","index":6,"n_rows":37,"n_cols":13,"rows_kept":37,"cut":false,"hidden":false,"merged":[[31,0,31,1],[31,3,31,6],[31,8,31,11],[29,0,29,1],[29,3,29,6],[29,8,29,11],[30,0,30,1],[30,3,30,6],[30,8,30,11],[27,0,27,1],[27,3,27,6],[27,8,27,11],[28,0,28,1],[28,3,28,6],[28,8,28,11],[25,0,25,1],[25,3,25,6],[25,8,25,11],[26,0,26,1],[26,3,26,6],[26,8,26,11],[23,0,23,1],[23,3,23,6],[23,8,23,11],[24,0,24,1],[24,3,24,6],[24,8,24,11],[21,0,21,1],[21,3,21,6],[21,8,21,11],[22,0,22,1],[22,3,22,6],[22,8,22,11],[19,0,19,1],[19,3,19,6],[19,8,19,11],[20,0,20,1],[20,3,20,6],[20,8,20,11],[17,0,17,1],[17,3,17,6],[17,8,17,11],[18,0,18,1],[18,3,18,6],[18,8,18,11],[15,0,15,1],[15,3,15,6],[15,8,15,11],[16,0,16,1],[16,3,16,6],[16,8,16,11],[13,0,13,1],[13,3,13,6],[13,8,13,11],[14,0,14,1],[14,3,14,6],[14,8,14,11],[11,0,11,1],[11,3,11,6],[11,8,11,11],[12,0,12,1],[12,3,12,6],[12,8,12,11],[9,0,9,1],[9,3,9,6],[9,8,9,11],[10,0,10,1],[10,3,10,6],[10,8,10,11],[7,0,7,1],[7,3,7,6],[7,8,7,11],[8,0,8,1],[8,3,8,6],[8,8,8,11],[5,0,6,2],[5,3,6,6],[5,8,6,12],[1,1,1,4],[2,1,2,4],[4,0,4,2],[4,3,4,7],[4,8,4,12]]}
["Etablissement ",{"$f":"IF(ISBLANK(Présentation!B4),\"\",Présentation!B4)","v":"Nom de l'établissement"},null,null,null,null,null,"Codes à saisir >",0,1,2,3,4]
["Diplôme",{"$f":"IF(ISBLANK(Présentation!B5),\"\",Présentation!B5)","v":"Seconde professionnelle [F] MHR"},null,null,null,null,null,"Signification","Non fait","Non maîtrisé","Insuffisamment maîtrisé","Maîtrise satisfaisante","Très bonne maîtrise"]
["Nom de l'apprenant",{"$f":"IF(ISBLANK(Présentation!$K5),\"\",Présentation!$K5)","v":"N&P Apprenant 3"},null,null,null,null,null,"Indication visuelle",0,1,2,3,4]
[]
["Epreuve 1",null,null,"Epreuve 2",null,null,null,null,"Epreuve 3"]
[{"$f":"(IF(ISBLANK(Présentation!B7),\"\",Présentation!B7))","v":"Titre activité 1"},null,null,{"$f":"IF(ISBLANK(Présentation!B8),\"\",Présentation!B8)","v":"Titre activité 2"},null,null,null,null,{"$f":"IF(ISBLANK(Présentation!B9),\"\",Présentation!B9)","v":"Titre activité 3"}]
[]
[{"$f":"Activité1!A8","v":"Act1 - Compétence 1 sur trois lignes pour impression"},null,{"$f":"Activité1!D8","v":0},{"$f":"Activité2!A8","v":"Act2 - Compétence 1 sur trois lignes pour impression"},null,null,null,{"$f":"Activité2!D8","v":0},{"$f":"Activité3!A8","v":"Act3 - Compétence 1 sur trois lignes pour impression"},null,null,null,{"$f":"Activité3!D8","v":0}]
[{"$f":"Activité1!A9","v":"Act1 - Compétence 2"},null,{"$f":"Activité1!D9","v":0},{"$f":"Activité2!A9","v":"Act2 - Compétence 2"},null,null,null,{"$f":"Activité2!D9","v":0},{"$f":"Activité3!A9","v":"Act3 - Compétence 2"},null,null,null,{"$f":"Activité3!D9","v":0}]
[{"$f":"Activité1!A10","v":"Act1 - Compétence 3"},null,{"$f":"Activité1!D10","v":0},{"$f":"Activité2!A10","v":"Act2 - Compétence 3"},null,null,null,{"$f":"Activité2!D10","v":0},{"$f":"Activité3!A10","v":"Act3 - Compétence 3"},null,null,null,{"$f":"Activité3!D10","v":0}]
[{"$f":"Activité1!A11","v":"Act1 - Compétence 4"},null,{"$f":"Activité1!D11","v":0},{"$f":"Activité2!A11","v":"Act2 - Compétence 4"},null,null,null,{"$f":"Activité2!D11","v":0},{"$f":"Activité3!A11","v":"Act3 - Compétence 4"},null,null,null,{"$f":"Activité3!D11","v":0}]
[{"$f":"Activité1!A12","v":"Act1 - Compétence 5"},null,{"$f":"Activité1!D12","v":0},{"$f":"Activité2!A12","v":"Act2 - Compétence 5"},null,null,null,{"$f":"Activité2!D12","v":0},{"$f":"Activité3!A12","v":"Act3 - Compétence 5"},null,null,null,{"$f":"Activité3!D12","v":0}]
[{"$f":"Activité1!A13","v":"Act1 - Compétence 6"},null,{"$f":"Activité1!D13","v":0},{"$f":"Activité2!A13","v":"Act2 - Compétence 6"},null,null,null,{"$f":"Activité2!D13","v":0},{"$f":"Activité3!A13","v":"Act3 - Compétence 6"},null,null,null,{"$f":"Activité3!D13","v":0}]
[{"$f":"Activité1!A14","v":"Act1 - Compétence 7"},null,{"$f":"Activité1!D14","v":0},{"$f":"Activité2!A14","v":"Act2 - Compétence 7"},null,null,null,{"$f":"Activité2!D14","v":0},{"$f":"Activité3!A14","v":"Act3 - Compétence 7"},null,null,null,{"$f":"Activité3!D14","v":0}]
[{"$f":"Activité1!A15","v":"Act1 - Compétence 8"},null,{"$f":"Activité1!D15","v":0},{"$f":"Activité2!A15","v":"Act2 - Compétence 8"},null,null,null,{"$f":"Activité2!D15","v":0},{"$f":"Activité3!A15","v":"Act3 - Compétence 8"},null,null,null,{"$f":"Activité3!D15","v":0}]
[{"$f":"Activité1!A16","v":"Act1 - Compétence 9"},null,{"$f":"Activité1!D16","v":0},{"$f":"Activité2!A16","v":"Act2 - Compétence 9"},null,null,null,{"$f":"Activité2!D16","v":0},{"$f":"Activité3!A16","v":"Act3 - Compétence 9"},null,null,null,{"$f":"Activité3!D16","v":0}]
[{"$f":"Activité1!A17","v":"Act1 - Compétence 10"},null,{"$f":"Activité1!D17","v":0},{"$f":"Activité2!A17","v":"Act2 - Compétence 10"},null,null,null,{"$f":"Activité2!D17","v":0},{"$f":"Activité3!A17","v":"Act3 - Compétence 10"},null,null,null,{"$f":"Activité3!D17","v":0}]
[{"$f":"Activité1!A18","v":"Act1 - Compétence 11"},null,{"$f":"Activité1!D18","v":0},{"$f":"Activité2!A18","v":"Act2 - Compétence 11"},null,null,null,{"$f":"Activité2!D18","v":0},{"$f":"Activité3!A18","v":"Act3 - Compétence 11"},null,null,null,{"$f":"Activité3!D18","v":0}]
[{"$f":"Activité1!A19","v":"Act1 - Compétence 12"},null,{"$f":"Activité1!D19","v":0},{"$f":"Activité2!A19","v":"Act2 - Compétence 12"},null,null,null,{"$f":"Activité2!D19","v":0},{"$f":"Activité3!A19","v":"Act3 - Compétence 12"},null,null,null,{"$f":"Activité3!D19","v":0}]
[{"$f":"Activité1!A20","v":"Act1 - Compétence 13"},null,{"$f":"Activité1!D20","v":0},{"$f":"Activité2!A20","v":"Act2 - Compétence 13"},null,null,null,{"$f":"Activité2!D20","v":0},{"$f":"Activité3!A20","v":"Act3 - Compétence 13"},null,null,null,{"$f":"Activité3!D20","v":0}]
[{"$f":"Activité1!A21","v":"Act1 - Compétence 14"},null,{"$f":"Activité1!D21","v":0},{"$f":"Activité2!A21","v":"Act2 - Compétence 14"},null,null,null,{"$f":"Activité2!D21","v":0},{"$f":"Activité3!A21","v":"Act3 - Compétence 14"},null,null,null,{"$f":"Activité3!D21","v":0}]
[{"$f":"Activité1!A22","v":"Act1 - Compétence 15"},null,{"$f":"Activité1!D22","v":0},{"$f":"Activité2!A22","v":"Act2 - Compétence 15"},null,null,null,{"$f":"Activité2!D22","v":0},{"$f":"Activité3!A22","v":"Act3 - Compétence 15"},null,null,null,{"$f":"Activité3!D22","v":0}]
[{"$f":"Activité1!A23","v":"Act1 - Compétence 16"},null,{"$f":"Activité1!D23","v":0},{"$f":"Activité2!A23","v":"Act2 - Compétence 16"},null,null,null,{"$f":"Activité2!D23","v":0},{"$f":"Activité3!A23","v":"Act3 - Compétence 16"},null,null,null,{"$f":"Activité3!D23","v":0}]
[{"$f":"Activité1!A24","v":"Act1 - Compétence 17"},null,{"$f":"Activité1!D24","v":0},{"$f":"Activité2!A24","v":"Act2 - Compétence 17"},null,null,null,{"$f":"Activité2!D24","v":0},{"$f":"Activité3!A24","v":"Act3 - Compétence 17"},null,null,null,{"$f":"Activité3!D24","v":0}]
[{"$f":"Activité1!A25","v":"Act1 - Compétence 18"},null,{"$f":"Activité1!D25","v":0},{"$f":"Activité2!A25","v":"Act2 - Compétence 18"},null,null,null,{"$f":"Activité2!D25","v":0},{"$f":"Activité3!A25","v":"Act3 - Compétence 18"},null,null,null,{"$f":"Activité3!D25","v":0}]
[{"$f":"Activité1!A26","v":"Act1 - Compétence 19"},null,{"$f":"Activité1!D26","v":0},{"$f":"Activité2!A26","v":"Act2 - Compétence 19"},null,null,null,{"$f":"Activité2!D26","v":0},{"$f":"Activité3!A26","v":"Act3 - Compétence 19"},null,null,null,{"$f":"Activité3!D26","v":0}]
[{"$f":"Activité1!A27","v":"Act1 - Compétence 20"},null,{"$f":"Activité1!D27","v":0},{"$f":"Activité2!A27","v":"Act2 - Compétence 20"},null,null,null,{"$f":"Activité2!D27","v":0},{"$f":"Activité3!A27","v":"Act3 - Compétence 20"},null,null,null,{"$f":"Activité3!D27","v":0}]
[{"$f":"Activité1!A28","v":"Act1 - Compétence 21"},null,{"$f":"Activité1!D28","v":0},{"$f":"Activité2!A28","v":"Act2 - Compétence 21"},null,null,null,{"$f":"Activité2!D28","v":0},{"$f":"Activité3!A28","v":"Act3 - Compétence 21"},null,null,null,{"$f":"Activité3!D28","v":0}]
[{"$f":"Activité1!A29","v":"Act1 - Compétence 22"},null,{"$f":"Activité1!D29","v":0},{"$f":"Activité2!A29","v":"Act2 - Compétence 22"},null,null,null,{"$f":"Activité2!D29","v":0},{"$f":"Activité3!A29","v":"Act3 - Compétence 22"},null,null,null,{"$f":"Activité3!D29","v":0}]
[{"$f":"Activité1!A30","v":"Act1 - Compétence 23"},null,{"$f":"Activité1!D30","v":0},{"$f":"Activité2!A30","v":"Act2 - Compétence 23"},null,null,null,{"$f":"Activité2!D30","v":0},{"$f":"Activité3!A30","v":"Act3 - Compétence 23"},null,null,null,{"$f":"Activité3!D30","v":0}]
[{"$f":"Activité1!A31","v":"Act1 - Compétence 24"},null,{"$f":"Activité1!D31","v":0},{"$f":"Activité2!A31","v":"Act2 - Compétence 24"},null,null,null,{"$f":"Activité2!D31","v":0},{"$f":"Activité3!A31","v":"Act3 - Compétence 24"},null,null,null,{"$f":"Activité3!D31","v":0}]
[{"$f":"Activité1!A32","v":"Act1 - Compétence 25"},null,{"$f":"Activité1!D32","v":0},{"$f":"Activité2!A32","v":"Act2 - Compétence 25"},null,null,null,{"$f":"Activité2!D32","v":0},{"$f":"Activité3!A32","v":"Act3 - Compétence 25"},null,null,null,{"$f":"Activité3!D32","v":0}]
[]
[]
["Note proposée sur 20 (0,5 pts)",null,{"$f":"Activité1!D35","v":"Note"},null,null,null,null,{"$f":"Activité2!D35","v":"Note"},null,null,null,null,{"$f":"Activité3!D35","v":"Note"}]
[]
["Note avec coef",null,{"$f":"Activité1!D37","v":""},null,null,null,null,{"$f":"Activité2!D37","v":""},null,null,null,null,{"$f":"Activité3!D37","v":""}]

{"sheet":"FicheApp04","index":7,"n_rows":37,"n_cols":13,"rows_kept":37,"cut":false,"hidden":false,"merged":[[31,0,31,1],[31,3,31,6],[31,8,31,11],[29,0,29,1],[29,3,29,6],[29,8,29,11],[30,0,30,1],[30,3,30,6],[30,8,30,11],[27,0,27,1],[27,3,27,6],[27,8,27,11],[28,0,28,1],[28,3,28,6],[28,8,28,11],[25,0,25,1],[25,3,25,6],[25,8,25,11],[26,0,26,1],[26,3,26,6],[26,8,26,11],[23,0,23,1],[23,3,23,6],[23,8,23,11],[24,0,24,1],[24,3,24,6],[24,8,24,11],[21,0,21,1],[21,3,21,6],[21,8,21,11],[22,0,22,1],[22,3,22,6],[22,8,22,11],[19,0,19,1],[19,3,19,6],[19,8,19,11],[20,0,20,1],[20,3,20,6],[20,8,20,11],[17,0,17,1],[17,3,17,6],[17,8,17,11],[18,0,18,1],[18,3,18,6],[18,8,18,11],[15,0,15,1],[15,3,15,6],[15,8,15,11],[16,0,16,1],[16,3,16,6],[16,8,16,11],[13,0,13,1],[13,3,13,6],[13,8,13,11],[14,0,14,1],[14,3,14,6],[14,8,14,11],[11,0,11,1],[11,3,11,6],[11,8,11,11],[12,0,12,1],[12,3,12,6],[12,8,12,11],[9,0,9,1],[9,3,9,6],[9,8,9,11],[10,0,10,1],[10,3,10,6],[10,8,10,11],[7,0,7,1],[7,3,7,6],[7,8,7,11],[8,0,8,1],[8,3,8,6],[8,8,8,11],[5,0,6,2],[5,3,6,6],[5,8,6,12],[1,1,1,4],[2,1,2,4],[4,0,4,2],[4,3,4,7],[4,8,4,12]]}
["Etablissement ",{"$f":"IF(ISBLANK(Présentation!B4),\"\",Présentation!B4)","v":"Nom de l'établissement"},null,null,null,null,null,"Codes à saisir >",0,1,2,3,4]
["Diplôme",{"$f":"IF(ISBLANK(Présentation!B5),\"\",Présentation!B5)","v":"Seconde professionnelle [F] MHR"},null,null,null,null,null,"Signification","Non fait","Non maîtrisé","Insuffisamment maîtrisé","Maîtrise satisfaisante","Très bonne maîtrise"]
["Nom de l'apprenant",{"$f":"IF(ISBLANK(Présentation!$K6),\"\",Présentation!$K6)","v":"N&P Apprenant 4"},null,null,null,null,null,"Indication visuelle",0,1,2,3,4]
[]
["Epreuve 1",null,null,"Epreuve 2",null,null,null,null,"Epreuve 3"]
[{"$f":"(IF(ISBLANK(Présentation!B7),\"\",Présentation!B7))","v":"Titre activité 1"},null,null,{"$f":"IF(ISBLANK(Présentation!B8),\"\",Présentation!B8)","v":"Titre activité 2"},null,null,null,null,{"$f":"IF(ISBLANK(Présentation!B9),\"\",Présentation!B9)","v":"Titre activité 3"}]
[]
[{"$f":"Activité1!A8","v":"Act1 - Compétence 1 sur trois lignes pour impression"},null,{"$f":"Activité1!E8","v":0},{"$f":"Activité2!A8","v":"Act2 - Compétence 1 sur trois lignes pour impression"},null,null,null,{"$f":"Activité2!E8","v":0},{"$f":"Activité3!A8","v":"Act3 - Compétence 1 sur trois lignes pour impression"},null,null,null,{"$f":"Activité3!E8","v":0}]
[{"$f":"Activité1!A9","v":"Act1 - Compétence 2"},null,{"$f":"Activité1!E9","v":0},{"$f":"Activité2!A9","v":"Act2 - Compétence 2"},null,null,null,{"$f":"Activité2!E9","v":0},{"$f":"Activité3!A9","v":"Act3 - Compétence 2"},null,null,null,{"$f":"Activité3!E9","v":0}]
[{"$f":"Activité1!A10","v":"Act1 - Compétence 3"},null,{"$f":"Activité1!E10","v":0},{"$f":"Activité2!A10","v":"Act2 - Compétence 3"},null,null,null,{"$f":"Activité2!E10","v":0},{"$f":"Activité3!A10","v":"Act3 - Compétence 3"},null,null,null,{"$f":"Activité3!E10","v":0}]
[{"$f":"Activité1!A11","v":"Act1 - Compétence 4"},null,{"$f":"Activité1!E11","v":0},{"$f":"Activité2!A11","v":"Act2 - Compétence 4"},null,null,null,{"$f":"Activité2!E11","v":0},{"$f":"Activité3!A11","v":"Act3 - Compétence 4"},null,null,null,{"$f":"Activité3!E11","v":0}]
[{"$f":"Activité1!A12","v":"Act1 - Compétence 5"},null,{"$f":"Activité1!E12","v":0},{"$f":"Activité2!A12","v":"Act2 - Compétence 5"},null,null,null,{"$f":"Activité2!E12","v":0},{"$f":"Activité3!A12","v":"Act3 - Compétence 5"},null,null,null,{"$f":"Activité3!E12","v":0}]
[{"$f":"Activité1!A13","v":"Act1 - Compétence 6"},null,{"$f":"Activité1!E13","v":0},{"$f":"Activité2!A13","v":"Act2 - Compétence 6"},null,null,null,{"$f":"Activité2!E13","v":0},{"$f":"Activité3!A13","v":"Act3 - Compétence 6"},null,null,null,{"$f":"Activité3!E13","v":0}]
[{"$f":"Activité1!A14","v":"Act1 - Compétence 7"},null,{"$f":"Activité1!E14","v":0},{"$f":"Activité2!A14","v":"Act2 - Compétence 7"},null,null,null,{"$f":"Activité2!E14","v":0},{"$f":"Activité3!A14","v":"Act3 - Compétence 7"},null,null,null,{"$f":"Activité3!E14","v":0}]
[{"$f":"Activité1!A15","v":"Act1 - Compétence 8"},null,{"$f":"Activité1!E15","v":0},{"$f":"Activité2!A15","v":"Act2 - Compétence 8"},null,null,null,{"$f":"Activité2!E15","v":0},{"$f":"Activité3!A15","v":"Act3 - Compétence 8"},null,null,null,{"$f":"Activité3!E15","v":0}]
[{"$f":"Activité1!A16","v":"Act1 - Compétence 9"},null,{"$f":"Activité1!E16","v":0},{"$f":"Activité2!A16","v":"Act2 - Compétence 9"},null,null,null,{"$f":"Activité2!E16","v":0},{"$f":"Activité3!A16","v":"Act3 - Compétence 9"},null,null,null,{"$f":"Activité3!E16","v":0}]
[{"$f":"Activité1!A17","v":"Act1 - Compétence 10"},null,{"$f":"Activité1!E17","v":0},{"$f":"Activité2!A17","v":"Act2 - Compétence 10"},null,null,null,{"$f":"Activité2!E17","v":0},{"$f":"Activité3!A17","v":"Act3 - Compétence 10"},null,null,null,{"$f":"Activité3!E17","v":0}]
[{"$f":"Activité1!A18","v":"Act1 - Compétence 11"},null,{"$f":"Activité1!E18","v":0},{"$f":"Activité2!A18","v":"Act2 - Compétence 11"},null,null,null,{"$f":"Activité2!E18","v":0},{"$f":"Activité3!A18","v":"Act3 - Compétence 11"},null,null,null,{"$f":"Activité3!E18","v":0}]
[{"$f":"Activité1!A19","v":"Act1 - Compétence 12"},null,{"$f":"Activité1!E19","v":0},{"$f":"Activité2!A19","v":"Act2 - Compétence 12"},null,null,null,{"$f":"Activité2!E19","v":0},{"$f":"Activité3!A19","v":"Act3 - Compétence 12"},null,null,null,{"$f":"Activité3!E19","v":0}]
[{"$f":"Activité1!A20","v":"Act1 - Compétence 13"},null,{"$f":"Activité1!E20","v":0},{"$f":"Activité2!A20","v":"Act2 - Compétence 13"},null,null,null,{"$f":"Activité2!E20","v":0},{"$f":"Activité3!A20","v":"Act3 - Compétence 13"},null,null,null,{"$f":"Activité3!E20","v":0}]
[{"$f":"Activité1!A21","v":"Act1 - Compétence 14"},null,{"$f":"Activité1!E21","v":0},{"$f":"Activité2!A21","v":"Act2 - Compétence 14"},null,null,null,{"$f":"Activité2!E21","v":0},{"$f":"Activité3!A21","v":"Act3 - Compétence 14"},null,null,null,{"$f":"Activité3!E21","v":0}]
[{"$f":"Activité1!A22","v":"Act1 - Compétence 15"},null,{"$f":"Activité1!E22","v":0},{"$f":"Activité2!A22","v":"Act2 - Compétence 15"},null,null,null,{"$f":"Activité2!E22","v":0},{"$f":"Activité3!A22","v":"Act3 - Compétence 15"},null,null,null,{"$f":"Activité3!E22","v":0}]
[{"$f":"Activité1!A23","v":"Act1 - Compétence 16"},null,{"$f":"Activité1!E23","v":0},{"$f":"Activité2!A23","v":"Act2 - Compétence 16"},null,null,null,{"$f":"Activité2!E23","v":0},{"$f":"Activité3!A23","v":"Act3 - Compétence 16"},null,null,null,{"$f":"Activité3!E23","v":0}]
[{"$f":"Activité1!A24","v":"Act1 - Compétence 17"},null,{"$f":"Activité1!E24","v":0},{"$f":"Activité2!A24","v":"Act2 - Compétence 17"},null,null,null,{"$f":"Activité2!E24","v":0},{"$f":"Activité3!A24","v":"Act3 - Compétence 17"},null,null,null,{"$f":"Activité3!E24","v":0}]
[{"$f":"Activité1!A25","v":"Act1 - Compétence 18"},null,{"$f":"Activité1!E25","v":0},{"$f":"Activité2!A25","v":"Act2 - Compétence 18"},null,null,null,{"$f":"Activité2!E25","v":0},{"$f":"Activité3!A25","v":"Act3 - Compétence 18"},null,null,null,{"$f":"Activité3!E25","v":0}]
[{"$f":"Activité1!A26","v":"Act1 - Compétence 19"},null,{"$f":"Activité1!E26","v":0},{"$f":"Activité2!A26","v":"Act2 - Compétence 19"},null,null,null,{"$f":"Activité2!E26","v":0},{"$f":"Activité3!A26","v":"Act3 - Compétence 19"},null,null,null,{"$f":"Activité3!E26","v":0}]
[{"$f":"Activité1!A27","v":"Act1 - Compétence 20"},null,{"$f":"Activité1!E27","v":0},{"$f":"Activité2!A27","v":"Act2 - Compétence 20"},null,null,null,{"$f":"Activité2!E27","v":0},{"$f":"Activité3!A27","v":"Act3 - Compétence 20"},null,null,null,{"$f":"Activité3!E27","v":0}]
[{"$f":"Activité1!A28","v":"Act1 - Compétence 21"},null,{"$f":"Activité1!E28","v":0},{"$f":"Activité2!A28","v":"Act2 - Compétence 21"},null,null,null,{"$f":"Activité2!E28","v":0},{"$f":"Activité3!A28","v":"Act3 - Compétence 21"},null,null,null,{"$f":"Activité3!E28","v":0}]
[{"$f":"Activité1!A29","v":"Act1 - Compétence 22"},null,{"$f":"Activité1!E29","v":0},{"$f":"Activité2!A29","v":"Act2 - Compétence 22"},null,null,null,{"$f":"Activité2!E29","v":0},{"$f":"Activité3!A29","v":"Act3 - Compétence 22"},null,null,null,{"$f":"Activité3!E29","v":0}]
[{"$f":"Activité1!A30","v":"Act1 - Compétence 23"},null,{"$f":"Activité1!E30","v":0},{"$f":"Activité2!A30","v":"Act2 - Compétence 23"},null,null,null,{"$f":"Activité2!E30","v":0},{"$f":"Activité3!A30","v":"Act3 - Compétence 23"},null,null,null,{"$f":"Activité3!E30","v":0}]
[{"$f":"Activité1!A31","v":"Act1 - Compétence 24"},null,{"$f":"Activité1!E31","v":0},{"$f":"Activité2!A31","v":"Act2 - Compétence 24"},null,null,null,{"$f":"Activité2!E31","v":0},{"$f":"Activité3!A31","v":"Act3 - Compétence 24"},null,null,null,{"$f":"Activité3!E31","v":0}]
[{"$f":"Activité1!A32","v":"Act1 - Compétence 25"},null,{"$f":"Activité1!E32","v":0},{"$f":"Activité2!A32","v":"Act2 - Compétence 25"},null,null,null,{"$f":"Activité2!E32","v":0},{"$f":"Activité3!A32","v":"Act3 - Compétence 25"},null,null,null,{"$f":"Activité3!E32","v":0}]
[]
[]
["Note proposée sur 20 (0,5 pts)",null,{"$f":"Activité1!E35","v":"Note"},null,null,null,null,{"$f":"Activité2!E35","v":"Note"},null,null,null,null,{"$f":"Activité3!E35","v":"Note"}]
[]
["Note avec coef",null,{"$f":"Activité1!E37","v":""},null,null,null,null,{"$f":"Activité2!E37","v":""},null,null,null,null,{"$f":"Activité3!E37","v":""}]

{"sheet":"FicheApp05","index":8,"n_rows":37,"n_cols":13,"rows_kept":37,"cut":false,"hidden":false,"merged":[[31,0,31,1],[31,3,31,6],[31,8,31,11],[29,0,29,1],[29,3,29,6],[29,8,29,11],[30,0,30,1],[30,3,30,6],[30,8,30,11],[27,0,27,1],[27,3,27,6],[27,8,27,11],[28,0,28,1],[28,3,28,6],[28,8,28,11],[25,0,25,1],[25,3,25,6],[25,8,25,11],[26,0,26,1],[26,3,26,6],[26,8,26,11],[23,0,23,1],[23,3,23,6],[23,8,23,11],[24,0,24,1],[24,3,24,6],[24,8,24,11],[21,0,21,1],[21,3,21,6],[21,8,21,11],[22,0,22,1],[22,3,22,6],[22,8,22,11],[19,0,19,1],[19,3,19,6],[19,8,19,11],[20,0,20,1],[20,3,20,6],[20,8,20,11],[17,0,17,1],[17,3,17,6],[17,8,17,11],[18,0,18,1],[18,3,18,6],[18,8,18,11],[15,0,15,1],[15,3,15,6],[15,8,15,11],[16,0,16,1],[16,3,16,6],[16,8,16,11],[13,0,13,1],[13,3,13,6],[13,8,13,11],[14,0,14,1],[14,3,14,6],[14,8,14,11],[11,0,11,1],[11,3,11,6],[11,8,11,11],[12,0,12,1],[12,3,12,6],[12,8,12,11],[9,0,9,1],[9,3,9,6],[9,8,9,11],[10,0,10,1],[10,3,10,6],[10,8,10,11],[7,0,7,1],[7,3,7,6],[7,8,7,11],[8,0,8,1],[8,3,8,6],[8,8,8,11],[5,0,6,2],[5,3,6,6],[5,8,6,12],[1,1,1,4],[2,1,2,4],[4,0,4,2],[4,3,4,7],[4,8,4,12]]}
["Etablissement ",{"$f":"IF(ISBLANK(Présentation!B4),\"\",Présentation!B4)","v":"Nom de l'établissement"},null,null,null,null,null,"Codes à saisir >",0,1,2,3,4]
["Diplôme",{"$f":"IF(ISBLANK(Présentation!B5),\"\",Présentation!B5)","v":"Seconde professionnelle [F] MHR"},null,null,null,null,null,"Signification","Non fait","Non maîtrisé","Insuffisamment maîtrisé","Maîtrise satisfaisante","Très bonne maîtrise"]
["Nom de l'apprenant",{"$f":"IF(ISBLANK(Présentation!$K7),\"\",Présentation!$K7)","v":"N&P Apprenant 5"},null,null,null,null,null,"Indication visuelle",0,1,2,3,4]
[]
["Epreuve 1",null,null,"Epreuve 2",null,null,null,null,"Epreuve 3"]
[{"$f":"(IF(ISBLANK(Présentation!B7),\"\",Présentation!B7))","v":"Titre activité 1"},null,null,{"$f":"IF(ISBLANK(Présentation!B8),\"\",Présentation!B8)","v":"Titre activité 2"},null,null,null,null,{"$f":"IF(ISBLANK(Présentation!B9),\"\",Présentation!B9)","v":"Titre activité 3"}]
[]
[{"$f":"Activité1!A8","v":"Act1 - Compétence 1 sur trois lignes pour impression"},null,{"$f":"Activité1!F8","v":0},{"$f":"Activité2!A8","v":"Act2 - Compétence 1 sur trois lignes pour impression"},null,null,null,{"$f":"Activité2!F8","v":0},{"$f":"Activité3!A8","v":"Act3 - Compétence 1 sur trois lignes pour impression"},null,null,null,{"$f":"Activité3!F8","v":0}]
[{"$f":"Activité1!A9","v":"Act1 - Compétence 2"},null,{"$f":"Activité1!F9","v":0},{"$f":"Activité2!A9","v":"Act2 - Compétence 2"},null,null,null,{"$f":"Activité2!F9","v":0},{"$f":"Activité3!A9","v":"Act3 - Compétence 2"},null,null,null,{"$f":"Activité3!F9","v":0}]
[{"$f":"Activité1!A10","v":"Act1 - Compétence 3"},null,{"$f":"Activité1!F10","v":0},{"$f":"Activité2!A10","v":"Act2 - Compétence 3"},null,null,null,{"$f":"Activité2!F10","v":0},{"$f":"Activité3!A10","v":"Act3 - Compétence 3"},null,null,null,{"$f":"Activité3!F10","v":0}]
[{"$f":"Activité1!A11","v":"Act1 - Compétence 4"},null,{"$f":"Activité1!F11","v":0},{"$f":"Activité2!A11","v":"Act2 - Compétence 4"},null,null,null,{"$f":"Activité2!F11","v":0},{"$f":"Activité3!A11","v":"Act3 - Compétence 4"},null,null,null,{"$f":"Activité3!F11","v":0}]
[{"$f":"Activité1!A12","v":"Act1 - Compétence 5"},null,{"$f":"Activité1!F12","v":0},{"$f":"Activité2!A12","v":"Act2 - Compétence 5"},null,null,null,{"$f":"Activité2!F12","v":0},{"$f":"Activité3!A12","v":"Act3 - Compétence 5"},null,null,null,{"$f":"Activité3!F12","v":0}]
[{"$f":"Activité1!A13","v":"Act1 - Compétence 6"},null,{"$f":"Activité1!F13","v":0},{"$f":"Activité2!A13","v":"Act2 - Compétence 6"},null,null,null,{"$f":"Activité2!F13","v":0},{"$f":"Activité3!A13","v":"Act3 - Compétence 6"},null,null,null,{"$f":"Activité3!F13","v":0}]
[{"$f":"Activité1!A14","v":"Act1 - Compétence 7"},null,{"$f":"Activité1!F14","v":0},{"$f":"Activité2!A14","v":"Act2 - Compétence 7"},null,null,null,{"$f":"Activité2!F14","v":0},{"$f":"Activité3!A14","v":"Act3 - Compétence 7"},null,null,null,{"$f":"Activité3!F14","v":0}]
[{"$f":"Activité1!A15","v":"Act1 - Compétence 8"},null,{"$f":"Activité1!F15","v":0},{"$f":"Activité2!A15","v":"Act2 - Compétence 8"},null,null,null,{"$f":"Activité2!F15","v":0},{"$f":"Activité3!A15","v":"Act3 - Compétence 8"},null,null,null,{"$f":"Activité3!F15","v":0}]
[{"$f":"Activité1!A16","v":"Act1 - Compétence 9"},null,{"$f":"Activité1!F16","v":0},{"$f":"Activité2!A16","v":"Act2 - Compétence 9"},null,null,null,{"$f":"Activité2!F16","v":0},{"$f":"Activité3!A16","v":"Act3 - Compétence 9"},null,null,null,{"$f":"Activité3!F16","v":0}]
[{"$f":"Activité1!A17","v":"Act1 - Compétence 10"},null,{"$f":"Activité1!F17","v":0},{"$f":"Activité2!A17","v":"Act2 - Compétence 10"},null,null,null,{"$f":"Activité2!F17","v":0},{"$f":"Activité3!A17","v":"Act3 - Compétence 10"},null,null,null,{"$f":"Activité3!F17","v":0}]
[{"$f":"Activité1!A18","v":"Act1 - Compétence 11"},null,{"$f":"Activité1!F18","v":0},{"$f":"Activité2!A18","v":"Act2 - Compétence 11"},null,null,null,{"$f":"Activité2!F18","v":0},{"$f":"Activité3!A18","v":"Act3 - Compétence 11"},null,null,null,{"$f":"Activité3!F18","v":0}]
[{"$f":"Activité1!A19","v":"Act1 - Compétence 12"},null,{"$f":"Activité1!F19","v":0},{"$f":"Activité2!A19","v":"Act2 - Compétence 12"},null,null,null,{"$f":"Activité2!F19","v":0},{"$f":"Activité3!A19","v":"Act3 - Compétence 12"},null,null,null,{"$f":"Activité3!F19","v":0}]
[{"$f":"Activité1!A20","v":"Act1 - Compétence 13"},null,{"$f":"Activité1!F20","v":0},{"$f":"Activité2!A20","v":"Act2 - Compétence 13"},null,null,null,{"$f":"Activité2!F20","v":0},{"$f":"Activité3!A20","v":"Act3 - Compétence 13"},null,null,null,{"$f":"Activité3!F20","v":0}]
[{"$f":"Activité1!A21","v":"Act1 - Compétence 14"},null,{"$f":"Activité1!F21","v":0},{"$f":"Activité2!A21","v":"Act2 - Compétence 14"},null,null,null,{"$f":"Activité2!F21","v":0},{"$f":"Activité3!A21","v":"Act3 - Compétence 14"},null,null,null,{"$f":"Activité3!F21","v":0}]
[{"$f":"Activité1!A22","v":"Act1 - Compétence 15"},null,{"$f":"Activité1!F22","v":0},{"$f":"Activité2!A22","v":"Act2 - Compétence 15"},null,null,null,{"$f":"Activité2!F22","v":0},{"$f":"Activité3!A22","v":"Act3 - Compétence 15"},null,null,null,{"$f":"Activité3!F22","v":0}]
[{"$f":"Activité1!A23","v":"Act1 - Compétence 16"},null,{"$f":"Activité1!F23","v":0},{"$f":"Activité2!A23","v":"Act2 - Compétence 16"},null,null,null,{"$f":"Activité2!F23","v":0},{"$f":"Activité3!A23","v":"Act3 - Compétence 16"},null,null,null,{"$f":"Activité3!F23","v":0}]
[{"$f":"Activité1!A24","v":"Act1 - Compétence 17"},null,{"$f":"Activité1!F24","v":0},{"$f":"Activité2!A24","v":"Act2 - Compétence 17"},null,null,null,{"$f":"Activité2!F24","v":0},{"$f":"Activité3!A24","v":"Act3 - Compétence 17"},null,null,null,{"$f":"Activité3!F24","v":0}]
[{"$f":"Activité1!A25","v":"Act1 - Compétence 18"},null,{"$f":"Activité1!F25","v":0},{"$f":"Activité2!A25","v":"Act2 - Compétence 18"},null,null,null,{"$f":"Activité2!F25","v":0},{"$f":"Activité3!A25","v":"Act3 - Compétence 18"},null,null,null,{"$f":"Activité3!F25","v":0}]
[{"$f":"Activité1!A26","v":"Act1 - Compétence 19"},null,{"$f":"Activité1!F26","v":0},{"$f":"Activité2!A26","v":"Act2 - Compétence 19"},null,null,null,{"$f":"Activité2!F26","v":0},{"$f":"Activité3!A26","v":"Act3 - Compétence 19"},null,null,null,{"$f":"Activité3!F26","v":0}]
[{"$f":"Activité1!A27","v":"Act1 - Compétence 20"},null,{"$f":"Activité1!F27","v":0},{"$f":"Activité2!A27","v":"Act2 - Compétence 20"},null,null,null,{"$f":"Activité2!F27","v":0},{"$f":"Activité3!A27","v":"Act3 - Compétence 20"},null,null,null,{"$f":"Activité3!F27","v":0}]
[{"$f":"Activité1!A28","v":"Act1 - Compétence 21"},null,{"$f":"Activité1!F28","v":0},{"$f":"Activité2!A28","v":"Act2 - Compétence 21"},null,null,null,{"$f":"Activité2!F28","v":0},{"$f":"Activité3!A28","v":"Act3 - Compétence 21"},null,null,null,{"$f":"Activité3!F28","v":0}]
[{"$f":"Activité1!A29","v":"Act1 - Compétence 22"},null,{"$f":"Activité1!F29","v":0},{"$f":"Activité2!A29","v":"Act2 - Compétence 22"},null,null,null,{"$f":"Activité2!F29","v":0},{"$f":"Activité3!A29","v":"Act3 - Compétence 22"},null,null,null,{"$f":"Activité3!F29","v":0}]
[{"$f":"Activité1!A30","v":"Act1 - Compétence 23"},null,{"$f":"Activité1!F30","v":0},{"$f":"Activité2!A30","v":"Act2 - Compétence 23"},null,null,null,{"$f":"Activité2!F30","v":0},{"$f":"Activité3!A30","v":"Act3 - Compétence 23"},null,null,null,{"$f":"Activité3!F30","v":0}]
[{"$f":"Activité1!A31","v":"Act1 - Compétence 24"},null,{"$f":"Activité1!F31","v":0},{"$f":"Activité2!A31","v":"Act2 - Compétence 24"},null,null,null,{"$f":"Activité2!F31","v":0},{"$f":"Activité3!A31","v":"Act3 - Compétence 24"},null,null,null,{"$f":"Activité3!F31","v":0}]
[{"$f":"Activité1!A32","v":"Act1 - Compétence 25"},null,{"$f":"Activité1!F32","v":0},{"$f":"Activité2!A32","v":"Act2 - Compétence 25"},null,null,null,{"$f":"Activité2!F32","v":0},{"$f":"Activité3!A32","v":"Act3 - Compétence 25"},null,null,null,{"$f":"Activité3!F32","v":0}]
[]
[]
["Note proposée sur 20 (0,5 pts)",null,{"$f":"Activité1!F35","v":"Note"},null,null,null,null,{"$f":"Activité2!F35","v":"Note"},null,null,null,null,{"$f":"Activité3!F35","v":"Note"}]
[]
["Note avec coef",null,{"$f":"Activité1!F37","v":""},null,null,null,null,{"$f":"Activité2!F37","v":""},null,null,null,null,{"$f":"Activité3!F37","v":""}]

{"sheet":"FicheApp06","index":9,"n_rows":37,"n_cols":13,"rows_kept":37,"cut":false,"hidden":false,"merged":[[31,0,31,1],[31,3,31,6],[31,8,31,11],[29,0,29,1],[29,3,29,6],[29,8,29,11],[30,0,30,1],[30,3,30,6],[30,8,30,11],[27,0,27,1],[27,3,27,6],[27,8,27,11],[28,0,28,1],[28,3,28,6],[28,8,28,11],[25,0,25,1],[25,3,25,6],[25,8,25,11],[26,0,26,1],[26,3,26,6],[26,8,26,11],[23,0,23,1],[23,3,23,6],[23,8,23,11],[24,0,24,1],[24,3,24,6],[24,8,24,11],[21,0,21,1],[21,3,21,6],[21,8,21,11],[22,0,22,1],[22,3,22,6],[22,8,22,11],[19,0,19,1],[19,3,19,6],[19,8,19,11],[20,0,20,1],[20,3,20,6],[20,8,20,11],[17,0,17,1],[17,3,17,6],[17,8,17,11],[18,0,18,1],[18,3,18,6],[18,8,18,11],[15,0,15,1],[15,3,15,6],[15,8,15,11],[16,0,16,1],[16,3,16,6],[16,8,16,11],[13,0,13,1],[13,3,13,6],[13,8,13,11],[14,0,14,1],[14,3,14,6],[14,8,14,11],[11,0,11,1],[11,3,11,6],[11,8,11,11],[12,0,12,1],[12,3,12,6],[12,8,12,11],[9,0,9,1],[9,3,9,6],[9,8,9,11],[10,0,10,1],[10,3,10,6],[10,8,10,11],[7,0,7,1],[7,3,7,6],[7,8,7,11],[8,0,8,1],[8,3,8,6],[8,8,8,11],[5,0,6,2],[5,3,6,6],[5,8,6,12],[1,1,1,4],[2,1,2,4],[4,0,4,2],[4,3,4,7],[4,8,4,12]]}
["Etablissement ",{"$f":"IF(ISBLANK(Présentation!B4),\"\",Présentation!B4)","v":"Nom de l'établissement"},null,null,null,null,null,"Codes à saisir >",0,1,2,3,4]
["Diplôme",{"$f":"IF(ISBLANK(Présentation!B5),\"\",Présentation!B5)","v":"Seconde professionnelle [F] MHR"},null,null,null,null,null,"Signification","Non fait","Non maîtrisé","Insuffisamment maîtrisé","Maîtrise satisfaisante","Très bonne maîtrise"]
["Nom de l'apprenant",{"$f":"IF(ISBLANK(Présentation!$K8),\"\",Présentation!$K8)","v":"N&P Apprenant 6"},null,null,null,null,null,"Indication visuelle",0,1,2,3,4]
[]
["Epreuve 1",null,null,"Epreuve 2",null,null,null,null,"Epreuve 3"]
[{"$f":"(IF(ISBLANK(Présentation!B7),\"\",Présentation!B7))","v":"Titre activité 1"},null,null,{"$f":"IF(ISBLANK(Présentation!B8),\"\",Présentation!B8)","v":"Titre activité 2"},null,null,null,null,{"$f":"IF(ISBLANK(Présentation!B9),\"\",Présentation!B9)","v":"Titre activité 3"}]
[]
[{"$f":"Activité1!A8","v":"Act1 - Compétence 1 sur trois lignes pour impression"},null,{"$f":"Activité1!G8","v":0},{"$f":"Activité2!A8","v":"Act2 - Compétence 1 sur trois lignes pour impression"},null,null,null,{"$f":"Activité2!G8","v":0},{"$f":"Activité3!A8","v":"Act3 - Compétence 1 sur trois lignes pour impression"},null,null,null,{"$f":"Activité3!G8","v":0}]
[{"$f":"Activité1!A9","v":"Act1 - Compétence 2"},null,{"$f":"Activité1!G9","v":0},{"$f":"Activité2!A9","v":"Act2 - Compétence 2"},null,null,null,{"$f":"Activité2!G9","v":0},{"$f":"Activité3!A9","v":"Act3 - Compétence 2"},null,null,null,{"$f":"Activité3!G9","v":0}]
[{"$f":"Activité1!A10","v":"Act1 - Compétence 3"},null,{"$f":"Activité1!G10","v":0},{"$f":"Activité2!A10","v":"Act2 - Compétence 3"},null,null,null,{"$f":"Activité2!G10","v":0},{"$f":"Activité3!A10","v":"Act3 - Compétence 3"},null,null,null,{"$f":"Activité3!G10","v":0}]
[{"$f":"Activité1!A11","v":"Act1 - Compétence 4"},null,{"$f":"Activité1!G11","v":0},{"$f":"Activité2!A11","v":"Act2 - Compétence 4"},null,null,null,{"$f":"Activité2!G11","v":0},{"$f":"Activité3!A11","v":"Act3 - Compétence 4"},null,null,null,{"$f":"Activité3!G11","v":0}]
[{"$f":"Activité1!A12","v":"Act1 - Compétence 5"},null,{"$f":"Activité1!G12","v":0},{"$f":"Activité2!A12","v":"Act2 - Compétence 5"},null,null,null,{"$f":"Activité2!G12","v":0},{"$f":"Activité3!A12","v":"Act3 - Compétence 5"},null,null,null,{"$f":"Activité3!G12","v":0}]
[{"$f":"Activité1!A13","v":"Act1 - Compétence 6"},null,{"$f":"Activité1!G13","v":0},{"$f":"Activité2!A13","v":"Act2 - Compétence 6"},null,null,null,{"$f":"Activité2!G13","v":0},{"$f":"Activité3!A13","v":"Act3 - Compétence 6"},null,null,null,{"$f":"Activité3!G13","v":0}]
[{"$f":"Activité1!A14","v":"Act1 - Compétence 7"},null,{"$f":"Activité1!G14","v":0},{"$f":"Activité2!A14","v":"Act2 - Compétence 7"},null,null,null,{"$f":"Activité2!G14","v":0},{"$f":"Activité3!A14","v":"Act3 - Compétence 7"},null,null,null,{"$f":"Activité3!G14","v":0}]
[{"$f":"Activité1!A15","v":"Act1 - Compétence 8"},null,{"$f":"Activité1!G15","v":0},{"$f":"Activité2!A15","v":"Act2 - Compétence 8"},null,null,null,{"$f":"Activité2!G15","v":0},{"$f":"Activité3!A15","v":"Act3 - Compétence 8"},null,null,null,{"$f":"Activité3!G15","v":0}]
[{"$f":"Activité1!A16","v":"Act1 - Compétence 9"},null,{"$f":"Activité1!G16","v":0},{"$f":"Activité2!A16","v":"Act2 - Compétence 9"},null,null,null,{"$f":"Activité2!G16","v":0},{"$f":"Activité3!A16","v":"Act3 - Compétence 9"},null,null,null,{"$f":"Activité3!G16","v":0}]
[{"$f":"Activité1!A17","v":"Act1 - Compétence 10"},null,{"$f":"Activité1!G17","v":0},{"$f":"Activité2!A17","v":"Act2 - Compétence 10"},null,null,null,{"$f":"Activité2!G17","v":0},{"$f":"Activité3!A17","v":"Act3 - Compétence 10"},null,null,null,{"$f":"Activité3!G17","v":0}]
[{"$f":"Activité1!A18","v":"Act1 - Compétence 11"},null,{"$f":"Activité1!G18","v":0},{"$f":"Activité2!A18","v":"Act2 - Compétence 11"},null,null,null,{"$f":"Activité2!G18","v":0},{"$f":"Activité3!A18","v":"Act3 - Compétence 11"},null,null,null,{"$f":"Activité3!G18","v":0}]
[{"$f":"Activité1!A19","v":"Act1 - Compétence 12"},null,{"$f":"Activité1!G19","v":0},{"$f":"Activité2!A19","v":"Act2 - Compétence 12"},null,null,null,{"$f":"Activité2!G19","v":0},{"$f":"Activité3!A19","v":"Act3 - Compétence 12"},null,null,null,{"$f":"Activité3!G19","v":0}]
[{"$f":"Activité1!A20","v":"Act1 - Compétence 13"},null,{"$f":"Activité1!G20","v":0},{"$f":"Activité2!A20","v":"Act2 - Compétence 13"},null,null,null,{"$f":"Activité2!G20","v":0},{"$f":"Activité3!A20","v":"Act3 - Compétence 13"},null,null,null,{"$f":"Activité3!G20","v":0}]
[{"$f":"Activité1!A21","v":"Act1 - Compétence 14"},null,{"$f":"Activité1!G21","v":0},{"$f":"Activité2!A21","v":"Act2 - Compétence 14"},null,null,null,{"$f":"Activité2!G21","v":0},{"$f":"Activité3!A21","v":"Act3 - Compétence 14"},null,null,null,{"$f":"Activité3!G21","v":0}]
[{"$f":"Activité1!A22","v":"Act1 - Compétence 15"},null,{"$f":"Activité1!G22","v":0},{"$f":"Activité2!A22","v":"Act2 - Compétence 15"},null,null,null,{"$f":"Activité2!G22","v":0},{"$f":"Activité3!A22","v":"Act3 - Compétence 15"},null,null,null,{"$f":"Activité3!G22","v":0}]
[{"$f":"Activité1!A23","v":"Act1 - Compétence 16"},null,{"$f":"Activité1!G23","v":0},{"$f":"Activité2!A23","v":"Act2 - Compétence 16"},null,null,null,{"$f":"Activité2!G23","v":0},{"$f":"Activité3!A23","v":"Act3 - Compétence 16"},null,null,null,{"$f":"Activité3!G23","v":0}]
[{"$f":"Activité1!A24","v":"Act1 - Compétence 17"},null,{"$f":"Activité1!G24","v":0},{"$f":"Activité2!A24","v":"Act2 - Compétence 17"},null,null,null,{"$f":"Activité2!G24","v":0},{"$f":"Activité3!A24","v":"Act3 - Compétence 17"},null,null,null,{"$f":"Activité3!G24","v":0}]
[{"$f":"Activité1!A25","v":"Act1 - Compétence 18"},null,{"$f":"Activité1!G25","v":0},{"$f":"Activité2!A25","v":"Act2 - Compétence 18"},null,null,null,{"$f":"Activité2!G25","v":0},{"$f":"Activité3!A25","v":"Act3 - Compétence 18"},null,null,null,{"$f":"Activité3!G25","v":0}]
[{"$f":"Activité1!A26","v":"Act1 - Compétence 19"},null,{"$f":"Activité1!G26","v":0},{"$f":"Activité2!A26","v":"Act2 - Compétence 19"},null,null,null,{"$f":"Activité2!G26","v":0},{"$f":"Activité3!A26","v":"Act3 - Compétence 19"},null,null,null,{"$f":"Activité3!G26","v":0}]
[{"$f":"Activité1!A27","v":"Act1 - Compétence 20"},null,{"$f":"Activité1!G27","v":0},{"$f":"Activité2!A27","v":"Act2 - Compétence 20"},null,null,null,{"$f":"Activité2!G27","v":0},{"$f":"Activité3!A27","v":"Act3 - Compétence 20"},null,null,null,{"$f":"Activité3!G27","v":0}]
[{"$f":"Activité1!A28","v":"Act1 - Compétence 21"},null,{"$f":"Activité1!G28","v":0},{"$f":"Activité2!A28","v":"Act2 - Compétence 21"},null,null,null,{"$f":"Activité2!G28","v":0},{"$f":"Activité3!A28","v":"Act3 - Compétence 21"},null,null,null,{"$f":"Activité3!G28","v":0}]
[{"$f":"Activité1!A29","v":"Act1 - Compétence 22"},null,{"$f":"Activité1!G29","v":0},{"$f":"Activité2!A29","v":"Act2 - Compétence 22"},null,null,null,{"$f":"Activité2!G29","v":0},{"$f":"Activité3!A29","v":"Act3 - Compétence 22"},null,null,null,{"$f":"Activité3!G29","v":0}]
[{"$f":"Activité1!A30","v":"Act1 - Compétence 23"},null,{"$f":"Activité1!G30","v":0},{"$f":"Activité2!A30","v":"Act2 - Compétence 23"},null,null,null,{"$f":"Activité2!G30","v":0},{"$f":"Activité3!A30","v":"Act3 - Compétence 23"},null,null,null,{"$f":"Activité3!G30","v":0}]
[{"$f":"Activité1!A31","v":"Act1 - Compétence 24"},null,{"$f":"Activité1!G31","v":0},{"$f":"Activité2!A31","v":"Act2 - Compétence 24"},null,null,null,{"$f":"Activité2!G31","v":0},{"$f":"Activité3!A31","v":"Act3 - Compétence 24"},null,null,null,{"$f":"Activité3!G31","v":0}]
[{"$f":"Activité1!A32","v":"Act1 - Compétence 25"},null,{"$f":"Activité1!G32","v":0},{"$f":"Activité2!A32","v":"Act2 - Compétence 25"},null,null,null,{"$f":"Activité2!G32","v":0},{"$f":"Activité3!A32","v":"Act3 - Compétence 25"},null,null,null,{"$f":"Activité3!G32","v":0}]
[]
[]
["Note proposée sur 20 (0,5 pts)",null,{"$f":"Activité1!G35","v":"Note"},null,null,null,null,{"$f":"Activité2!G35","v":"Note"},null,null,null,null,{"$f":"Activité3!G35","v":"Note"}]
[]
["Note avec coef",null,{"$f":"Activité1!G37","v":""},null,null,null,null,{"$f":"Activité2!G37","v":""},null,null,null,null,{"$f":"Activité3!G37","v":""}]

{"sheet":"FicheApp07","index":10,"n_rows":37,"n_cols":13,"rows_kept":37,"cut":false,"hidden":false,"merged":[[31,0,31,1],[31,3,31,6],[31,8,31,11],[29,0,29,1],[29,3,29,6],[29,8,29,11],[30,0,30,1],[30,3,30,6],[30,8,30,11],[27,0,27,1],[27,3,27,6],[27,8,27,11],[28,0,28,1],[28,3,28,6],[28,8,28,11],[25,0,25,1],[25,3,25,6],[25,8,25,11],[26,0,26,1],[26,3,26,6],[26,8,26,11],[23,0,23,1],[23,3,23,6],[23,8,23,11],[24,0,24,1],[24,3,24,6],[24,8,24,11],[21,0,21,1],[21,3,21,6],[21,8,21,11],[22,0,22,1],[22,3,22,6],[22,8,22,11],[19,0,19,1],[19,3,19,6],[19,8,19,11],[20,0,20,1],[20,3,20,6],[20,8,20,11],[17,0,17,1],[17,3,17,6],[17,8,17,11],[18,0,18,1],[18,3,18,6],[18,8,18,11],[15,0,15,1],[15,3,15,6],[15,8,15,11],[16,0,16,1],[16,3,16,6],[16,8,16,11],[13,0,13,1],[13,3,13,6],[13,8,13,11],[14,0,14,1],[14,3,14,6],[14,8,14,11],[11,0,11,1],[11,3,11,6],[11,8,11,11],[12,0,12,1],[12,3,12,6],[12,8,12,11],[9,0,9,1],[9,3,9,6],[9,8,9,11],[10,0,10,1],[10,3,10,6],[10,8,10,11],[7,0,7,1],[7,3,7,6],[7,8,7,11],[8,0,8,1],[8,3,8,6],[8,8,8,11],[5,0,6,2],[5,3,6,6],[5,8,6,12],[1,1,1,4],[2,1,2,4],[4,0,4,2],[4,3,4,7],[4,8,4,12]]}
["Etablissement ",{"$f":"IF(ISBLANK(Présentation!B4),\"\",Présentation!B4)","v":"Nom de l'établissement"},null,null,null,null,null,"Codes à saisir >",0,1,2,3,4]
["Diplôme",{"$f":"IF(ISBLANK(Présentation!B5),\"\",Présentation!B5)","v":"Seconde professionnelle [F] MHR"},null,null,null,null,null,"Signification","Non fait","Non maîtrisé","Insuffisamment maîtrisé","Maîtrise satisfaisante","Très bonne maîtrise"]
["Nom de l'apprenant",{"$f":"IF(ISBLANK(Présentation!$K9),\"\",Présentation!$K9)","v":"N&P Apprenant 7"},null,null,null,null,null,"Indication visuelle",0,1,2,3,4]
[]
["Epreuve 1",null,null,"Epreuve 2",null,null,null,null,"Epreuve 3"]
[{"$f":"(IF(ISBLANK(Présentation!B7),\"\",Présentation!B7))","v":"Titre activité 1"},null,null,{"$f":"IF(ISBLANK(Présentation!B8),\"\",Présentation!B8)","v":"Titre activité 2"},null,null,null,null,{"$f":"IF(ISBLANK(Présentation!B9),\"\",Présentation!B9)","v":"Titre activité 3"}]
[]
[{"$f":"Activité1!A8","v":"Act1 - Compétence 1 sur trois lignes pour impression"},null,{"$f":"Activité1!H8","v":0},{"$f":"Activité2!A8","v":"Act2 - Compétence 1 sur trois lignes pour impression"},null,null,null,{"$f":"Activité2!H8","v":0},{"$f":"Activité3!A8","v":"Act3 - Compétence 1 sur trois lignes pour impression"},null,null,null,{"$f":"Activité3!H8","v":0}]
[{"$f":"Activité1!A9","v":"Act1 - Compétence 2"},null,{"$f":"Activité1!H9","v":0},{"$f":"Activité2!A9","v":"Act2 - Compétence 2"},null,null,null,{"$f":"Activité2!H9","v":0},{"$f":"Activité3!A9","v":"Act3 - Compétence 2"},null,null,null,{"$f":"Activité3!H9","v":0}]
[{"$f":"Activité1!A10","v":"Act1 - Compétence 3"},null,{"$f":"Activité1!H10","v":0},{"$f":"Activité2!A10","v":"Act2 - Compétence 3"},null,null,null,{"$f":"Activité2!H10","v":0},{"$f":"Activité3!A10","v":"Act3 - Compétence 3"},null,null,null,{"$f":"Activité3!H10","v":0}]
[{"$f":"Activité1!A11","v":"Act1 - Compétence 4"},null,{"$f":"Activité1!H11","v":0},{"$f":"Activité2!A11","v":"Act2 - Compétence 4"},null,null,null,{"$f":"Activité2!H11","v":0},{"$f":"Activité3!A11","v":"Act3 - Compétence 4"},null,null,null,{"$f":"Activité3!H11","v":0}]
[{"$f":"Activité1!A12","v":"Act1 - Compétence 5"},null,{"$f":"Activité1!H12","v":0},{"$f":"Activité2!A12","v":"Act2 - Compétence 5"},null,null,null,{"$f":"Activité2!H12","v":0},{"$f":"Activité3!A12","v":"Act3 - Compétence 5"},null,null,null,{"$f":"Activité3!H12","v":0}]
[{"$f":"Activité1!A13","v":"Act1 - Compétence 6"},null,{"$f":"Activité1!H13","v":0},{"$f":"Activité2!A13","v":"Act2 - Compétence 6"},null,null,null,{"$f":"Activité2!H13","v":0},{"$f":"Activité3!A13","v":"Act3 - Compétence 6"},null,null,null,{"$f":"Activité3!H13","v":0}]
[{"$f":"Activité1!A14","v":"Act1 - Compétence 7"},null,{"$f":"Activité1!H14","v":0},{"$f":"Activité2!A14","v":"Act2 - Compétence 7"},null,null,null,{"$f":"Activité2!H14","v":0},{"$f":"Activité3!A14","v":"Act3 - Compétence 7"},null,null,null,{"$f":"Activité3!H14","v":0}]
[{"$f":"Activité1!A15","v":"Act1 - Compétence 8"},null,{"$f":"Activité1!H15","v":0},{"$f":"Activité2!A15","v":"Act2 - Compétence 8"},null,null,null,{"$f":"Activité2!H15","v":0},{"$f":"Activité3!A15","v":"Act3 - Compétence 8"},null,null,null,{"$f":"Activité3!H15","v":0}]
[{"$f":"Activité1!A16","v":"Act1 - Compétence 9"},null,{"$f":"Activité1!H16","v":0},{"$f":"Activité2!A16","v":"Act2 - Compétence 9"},null,null,null,{"$f":"Activité2!H16","v":0},{"$f":"Activité3!A16","v":"Act3 - Compétence 9"},null,null,null,{"$f":"Activité3!H16","v":0}]
[{"$f":"Activité1!A17","v":"Act1 - Compétence 10"},null,{"$f":"Activité1!H17","v":0},{"$f":"Activité2!A17","v":"Act2 - Compétence 10"},null,null,null,{"$f":"Activité2!H17","v":0},{"$f":"Activité3!A17","v":"Act3 - Compétence 10"},null,null,null,{"$f":"Activité3!H17","v":0}]
[{"$f":"Activité1!A18","v":"Act1 - Compétence 11"},null,{"$f":"Activité1!H18","v":0},{"$f":"Activité2!A18","v":"Act2 - Compétence 11"},null,null,null,{"$f":"Activité2!H18","v":0},{"$f":"Activité3!A18","v":"Act3 - Compétence 11"},null,null,null,{"$f":"Activité3!H18","v":0}]
[{"$f":"Activité1!A19","v":"Act1 - Compétence 12"},null,{"$f":"Activité1!H19","v":0},{"$f":"Activité2!A19","v":"Act2 - Compétence 12"},null,null,null,{"$f":"Activité2!H19","v":0},{"$f":"Activité3!A19","v":"Act3 - Compétence 12"},null,null,null,{"$f":"Activité3!H19","v":0}]
[{"$f":"Activité1!A20","v":"Act1 - Compétence 13"},null,{"$f":"Activité1!H20","v":0},{"$f":"Activité2!A20","v":"Act2 - Compétence 13"},null,null,null,{"$f":"Activité2!H20","v":0},{"$f":"Activité3!A20","v":"Act3 - Compétence 13"},null,null,null,{"$f":"Activité3!H20","v":0}]
[{"$f":"Activité1!A21","v":"Act1 - Compétence 14"},null,{"$f":"Activité1!H21","v":0},{"$f":"Activité2!A21","v":"Act2 - Compétence 14"},null,null,null,{"$f":"Activité2!H21","v":0},{"$f":"Activité3!A21","v":"Act3 - Compétence 14"},null,null,null,{"$f":"Activité3!H21","v":0}]
[{"$f":"Activité1!A22","v":"Act1 - Compétence 15"},null,{"$f":"Activité1!H22","v":0},{"$f":"Activité2!A22","v":"Act2 - Compétence 15"},null,null,null,{"$f":"Activité2!H22","v":0},{"$f":"Activité3!A22","v":"Act3 - Compétence 15"},null,null,null,{"$f":"Activité3!H22","v":0}]
[{"$f":"Activité1!A23","v":"Act1 - Compétence 16"},null,{"$f":"Activité1!H23","v":0},{"$f":"Activité2!A23","v":"Act2 - Compétence 16"},null,null,null,{"$f":"Activité2!H23","v":0},{"$f":"Activité3!A23","v":"Act3 - Compétence 16"},null,null,null,{"$f":"Activité3!H23","v":0}]
[{"$f":"Activité1!A24","v":"Act1 - Compétence 17"},null,{"$f":"Activité1!H24","v":0},{"$f":"Activité2!A24","v":"Act2 - Compétence 17"},null,null,null,{"$f":"Activité2!H24","v":0},{"$f":"Activité3!A24","v":"Act3 - Compétence 17"},null,null,null,{"$f":"Activité3!H24","v":0}]
[{"$f":"Activité1!A25","v":"Act1 - Compétence 18"},null,{"$f":"Activité1!H25","v":0},{"$f":"Activité2!A25","v":"Act2 - Compétence 18"},null,null,null,{"$f":"Activité2!H25","v":0},{"$f":"Activité3!A25","v":"Act3 - Compétence 18"},null,null,null,{"$f":"Activité3!H25","v":0}]
[{"$f":"Activité1!A26","v":"Act1 - Compétence 19"},null,{"$f":"Activité1!H26","v":0},{"$f":"Activité2!A26","v":"Act2 - Compétence 19"},null,null,null,{"$f":"Activité2!H26","v":0},{"$f":"Activité3!A26","v":"Act3 - Compétence 19"},null,null,null,{"$f":"Activité3!H26","v":0}]
[{"$f":"Activité1!A27","v":"Act1 - Compétence 20"},null,{"$f":"Activité1!H27","v":0},{"$f":"Activité2!A27","v":"Act2 - Compétence 20"},null,null,null,{"$f":"Activité2!H27","v":0},{"$f":"Activité3!A27","v":"Act3 - Compétence 20"},null,null,null,{"$f":"Activité3!H27","v":0}]
[{"$f":"Activité1!A28","v":"Act1 - Compétence 21"},null,{"$f":"Activité1!H28","v":0},{"$f":"Activité2!A28","v":"Act2 - Compétence 21"},null,null,null,{"$f":"Activité2!H28","v":0},{"$f":"Activité3!A28","v":"Act3 - Compétence 21"},null,null,null,{"$f":"Activité3!H28","v":0}]
[{"$f":"Activité1!A29","v":"Act1 - Compétence 22"},null,{"$f":"Activité1!H29","v":0},{"$f":"Activité2!A29","v":"Act2 - Compétence 22"},null,null,null,{"$f":"Activité2!H29","v":0},{"$f":"Activité3!A29","v":"Act3 - Compétence 22"},null,null,null,{"$f":"Activité3!H29","v":0}]
[{"$f":"Activité1!A30","v":"Act1 - Compétence 23"},null,{"$f":"Activité1!H30","v":0},{"$f":"Activité2!A30","v":"Act2 - Compétence 23"},null,null,null,{"$f":"Activité2!H30","v":0},{"$f":"Activité3!A30","v":"Act3 - Compétence 23"},null,null,null,{"$f":"Activité3!H30","v":0}]
[{"$f":"Activité1!A31","v":"Act1 - Compétence 24"},null,{"$f":"Activité1!H31","v":0},{"$f":"Activité2!A31","v":"Act2 - Compétence 24"},null,null,null,{"$f":"Activité2!H31","v":0},{"$f":"Activité3!A31","v":"Act3 - Compétence 24"},null,null,null,{"$f":"Activité3!H31","v":0}]
[{"$f":"Activité1!A32","v":"Act1 - Compétence 25"},null,{"$f":"Activité1!H32","v":0},{"$f":"Activité2!A32","v":"Act2 - Compétence 25"},null,null,null,{"$f":"Activité2!H32","v":0},{"$f":"Activité3!A32","v":"Act3 - Compétence 25"},null,null,null,{"$f":"Activité3!H32","v":0}]
[]
[]
["Note proposée sur 20 (0,5 pts)",null,{"$f":"Activité1!H35","v":"Note"},null,null,null,null,{"$f":"Activité2!H35","v":"Note"},null,null,null,null,{"$f":"Activité3!H35","v":"Note"}]
[]
["Note avec coef",null,{"$f":"Activité1!H37","v":""},null,null,null,null,{"$f":"Activité2!H37","v":""},null,null,null,null,{"$f":"Activité3!H37","v":""}]

{"sheet":"FicheApp08","index":11,"n_rows":37,"n_cols":13,"rows_kept":37,"cut":false,"hidden":false,"merged":[[31,0,31,1],[31,3,31,6],[31,8,31,11],[29,0,29,1],[29,3,29,6],[29,8,29,11],[30,0,30,1],[30,3,30,6],[30,8,30,11],[27,0,27,1],[27,3,27,6],[27,8,27,11],[28,0,28,1],[28,3,28,6],[28,8,28,11],[25,0,25,1],[25,3,25,6],[25,8,25,11],[26,0,26,1],[26,3,26,6],[26,8,26,11],[23,0,23,1],[23,3,23,6],[23,8,23,11],[24,0,24,1],[24,3,24,6],[24,8,24,11],[21,0,21,1],[21,3,21,6],[21,8,21,11],[22,0,22,1],[22,3,22,6],[22,8,22,11],[19,0,19,1],[19,3,19,6],[19,8,19,11],[20,0,20,1],[20,3,20,6],[20,8,20,11],[17,0,17,1],[17,3,17,6],[17,8,17,11],[18,0,18,1],[18,3,18,6],[18,8,18,11],[15,0,15,1],[15,3,15,6],[15,8,15,11],[16,0,16,1],[16,3,16,6],[16,8,16,11],[13,0,13,1],[13,3,13,6],[13,8,13,11],[14,0,14,1],[14,3,14,6],[14,8,14,11],[11,0,11,1],[11,3,11,6],[11,8,11,11],[12,0,12,1],[12,3,12,6],[12,8,12,11],[9,0,9,1],[9,3,9,6],[9,8,9,11],[10,0,10,1],[10,3,10,6],[10,8,10,11],[7,0,7,1],[7,3,7,6],[7,8,7,11],[8,0,8,1],[8,3,8,6],[8,8,8,11],[5,0,6,2],[5,3,6,6],[5,8,6,12],[1,1,1,4],[2,1,2,4],[4,0,4,2],[4,3,4,7],[4,8,4,12]]}
["Etablissement ",{"$f":"IF(ISBLANK(Présentation!B4),\"\",Présentation!B4)","v":"Nom de l'établissement"},null,null,null,null,null,"Codes à saisir >",0,1,2,3,4]
["Diplôme",{"$f":"IF(ISBLANK(Présentation!B5),\"\",Présentation!B5)","v":"Seconde professionnelle [F] MHR"},null,null,null,null,null,"Signification","Non fait","Non maîtrisé","Insuffisamment maîtrisé","Maîtrise satisfaisante","Très bonne maîtrise"]
["Nom de l'apprenant",{"$f":"IF(ISBLANK(Présentation!$K10),\"\",Présentation!$K10)","v":"N&P Apprenant 8"},null,null,null,null,null,"Indication visuelle",0,1,2,3,4]
[]
["Epreuve 1",null,null,"Epreuve 2",null,null,null,null,"Epreuve 3"]
[{"$f":"(IF(ISBLANK(Présentation!B7),\"\",Présentation!B7))","v":"Titre activité 1"},null,null,{"$f":"IF(ISBLANK(Présentation!B8),\"\",Présentation!B8)","v":"Titre activité 2"},null,null,null,null,{"$f":"IF(ISBLANK(Présentation!B9),\"\",Présentation!B9)","v":"Titre activité 3"}]
[]
[{"$f":"Activité1!A8","v":"Act1 - Compétence 1 sur trois lignes pour impression"},null,{"$f":"Activité1!I8","v":0},{"$f":"Activité2!A8","v":"Act2 - Compétence 1 sur trois lignes pour impression"},null,null,null,{"$f":"Activité2!I8","v":0},{"$f":"Activité3!A8","v":"Act3 - Compétence 1 sur trois lignes pour impression"},null,null,null,{"$f":"Activité3!I8","v":0}]
[{"$f":"Activité1!A9","v":"Act1 - Compétence 2"},null,{"$f":"Activité1!I9","v":0},{"$f":"Activité2!A9","v":"Act2 - Compétence 2"},null,null,null,{"$f":"Activité2!I9","v":0},{"$f":"Activité3!A9","v":"Act3 - Compétence 2"},null,null,null,{"$f":"Activité3!I9","v":0}]
[{"$f":"Activité1!A10","v":"Act1 - Compétence 3"},null,{"$f":"Activité1!I10","v":0},{"$f":"Activité2!A10","v":"Act2 - Compétence 3"},null,null,null,{"$f":"Activité2!I10","v":0},{"$f":"Activité3!A10","v":"Act3 - Compétence 3"},null,null,null,{"$f":"Activité3!I10","v":0}]
[{"$f":"Activité1!A11","v":"Act1 - Compétence 4"},null,{"$f":"Activité1!I11","v":0},{"$f":"Activité2!A11","v":"Act2 - Compétence 4"},null,null,null,{"$f":"Activité2!I11","v":0},{"$f":"Activité3!A11","v":"Act3 - Compétence 4"},null,null,null,{"$f":"Activité3!I11","v":0}]
[{"$f":"Activité1!A12","v":"Act1 - Compétence 5"},null,{"$f":"Activité1!I12","v":0},{"$f":"Activité2!A12","v":"Act2 - Compétence 5"},null,null,null,{"$f":"Activité2!I12","v":0},{"$f":"Activité3!A12","v":"Act3 - Compétence 5"},null,null,null,{"$f":"Activité3!I12","v":0}]
[{"$f":"Activité1!A13","v":"Act1 - Compétence 6"},null,{"$f":"Activité1!I13","v":0},{"$f":"Activité2!A13","v":"Act2 - Compétence 6"},null,null,null,{"$f":"Activité2!I13","v":0},{"$f":"Activité3!A13","v":"Act3 - Compétence 6"},null,null,null,{"$f":"Activité3!I13","v":0}]
[{"$f":"Activité1!A14","v":"Act1 - Compétence 7"},null,{"$f":"Activité1!I14","v":0},{"$f":"Activité2!A14","v":"Act2 - Compétence 7"},null,null,null,{"$f":"Activité2!I14","v":0},{"$f":"Activité3!A14","v":"Act3 - Compétence 7"},null,null,null,{"$f":"Activité3!I14","v":0}]
[{"$f":"Activité1!A15","v":"Act1 - Compétence 8"},null,{"$f":"Activité1!I15","v":0},{"$f":"Activité2!A15","v":"Act2 - Compétence 8"},null,null,null,{"$f":"Activité2!I15","v":0},{"$f":"Activité3!A15","v":"Act3 - Compétence 8"},null,null,null,{"$f":"Activité3!I15","v":0}]
[{"$f":"Activité1!A16","v":"Act1 - Compétence 9"},null,{"$f":"Activité1!I16","v":0},{"$f":"Activité2!A16","v":"Act2 - Compétence 9"},null,null,null,{"$f":"Activité2!I16","v":0},{"$f":"Activité3!A16","v":"Act3 - Compétence 9"},null,null,null,{"$f":"Activité3!I16","v":0}]
[{"$f":"Activité1!A17","v":"Act1 - Compétence 10"},null,{"$f":"Activité1!I17","v":0},{"$f":"Activité2!A17","v":"Act2 - Compétence 10"},null,null,null,{"$f":"Activité2!I17","v":0},{"$f":"Activité3!A17","v":"Act3 - Compétence 10"},null,null,null,{"$f":"Activité3!I17","v":0}]
[{"$f":"Activité1!A18","v":"Act1 - Compétence 11"},null,{"$f":"Activité1!I18","v":0},{"$f":"Activité2!A18","v":"Act2 - Compétence 11"},null,null,null,{"$f":"Activité2!I18","v":0},{"$f":"Activité3!A18","v":"Act3 - Compétence 11"},null,null,null,{"$f":"Activité3!I18","v":0}]
[{"$f":"Activité1!A19","v":"Act1 - Compétence 12"},null,{"$f":"Activité1!I19","v":0},{"$f":"Activité2!A19","v":"Act2 - Compétence 12"},null,null,null,{"$f":"Activité2!I19","v":0},{"$f":"Activité3!A19","v":"Act3 - Compétence 12"},null,null,null,{"$f":"Activité3!I19","v":0}]
[{"$f":"Activité1!A20","v":"Act1 - Compétence 13"},null,{"$f":"Activité1!I20","v":0},{"$f":"Activité2!A20","v":"Act2 - Compétence 13"},null,null,null,{"$f":"Activité2!I20","v":0},{"$f":"Activité3!A20","v":"Act3 - Compétence 13"},null,null,null,{"$f":"Activité3!I20","v":0}]
[{"$f":"Activité1!A21","v":"Act1 - Compétence 14"},null,{"$f":"Activité1!I21","v":0},{"$f":"Activité2!A21","v":"Act2 - Compétence 14"},null,null,null,{"$f":"Activité2!I21","v":0},{"$f":"Activité3!A21","v":"Act3 - Compétence 14"},null,null,null,{"$f":"Activité3!I21","v":0}]
[{"$f":"Activité1!A22","v":"Act1 - Compétence 15"},null,{"$f":"Activité1!I22","v":0},{"$f":"Activité2!A22","v":"Act2 - Compétence 15"},null,null,null,{"$f":"Activité2!I22","v":0},{"$f":"Activité3!A22","v":"Act3 - Compétence 15"},null,null,null,{"$f":"Activité3!I22","v":0}]
[{"$f":"Activité1!A23","v":"Act1 - Compétence 16"},null,{"$f":"Activité1!I23","v":0},{"$f":"Activité2!A23","v":"Act2 - Compétence 16"},null,null,null,{"$f":"Activité2!I23","v":0},{"$f":"Activité3!A23","v":"Act3 - Compétence 16"},null,null,null,{"$f":"Activité3!I23","v":0}]
[{"$f":"Activité1!A24","v":"Act1 - Compétence 17"},null,{"$f":"Activité1!I24","v":0},{"$f":"Activité2!A24","v":"Act2 - Compétence 17"},null,null,null,{"$f":"Activité2!I24","v":0},{"$f":"Activité3!A24","v":"Act3 - Compétence 17"},null,null,null,{"$f":"Activité3!I24","v":0}]
[{"$f":"Activité1!A25","v":"Act1 - Compétence 18"},null,{"$f":"Activité1!I25","v":0},{"$f":"Activité2!A25","v":"Act2 - Compétence 18"},null,null,null,{"$f":"Activité2!I25","v":0},{"$f":"Activité3!A25","v":"Act3 - Compétence 18"},null,null,null,{"$f":"Activité3!I25","v":0}]
[{"$f":"Activité1!A26","v":"Act1 - Compétence 19"},null,{"$f":"Activité1!I26","v":0},{"$f":"Activité2!A26","v":"Act2 - Compétence 19"},null,null,null,{"$f":"Activité2!I26","v":0},{"$f":"Activité3!A26","v":"Act3 - Compétence 19"},null,null,null,{"$f":"Activité3!I26","v":0}]
[{"$f":"Activité1!A27","v":"Act1 - Compétence 20"},null,{"$f":"Activité1!I27","v":0},{"$f":"Activité2!A27","v":"Act2 - Compétence 20"},null,null,null,{"$f":"Activité2!I27","v":0},{"$f":"Activité3!A27","v":"Act3 - Compétence 20"},null,null,null,{"$f":"Activité3!I27","v":0}]
[{"$f":"Activité1!A28","v":"Act1 - Compétence 21"},null,{"$f":"Activité1!I28","v":0},{"$f":"Activité2!A28","v":"Act2 - Compétence 21"},null,null,null,{"$f":"Activité2!I28","v":0},{"$f":"Activité3!A28","v":"Act3 - Compétence 21"},null,null,null,{"$f":"Activité3!I28","v":0}]
[{"$f":"Activité1!A29","v":"Act1 - Compétence 22"},null,{"$f":"Activité1!I29","v":0},{"$f":"Activité2!A29","v":"Act2 - Compétence 22"},null,null,null,{"$f":"Activité2!I29","v":0},{"$f":"Activité3!A29","v":"Act3 - Compétence 22"},null,null,null,{"$f":"Activité3!I29","v":0}]
[{"$f":"Activité1!A30","v":"Act1 - Compétence 23"},null,{"$f":"Activité1!I30","v":0},{"$f":"Activité2!A30","v":"Act2 - Compétence 23"},null,null,null,{"$f":"Activité2!I30","v":0},{"$f":"Activité3!A30","v":"Act3 - Compétence 23"},null,null,null,{"$f":"Activité3!I30","v":0}]
[{"$f":"Activité1!A31","v":"Act1 - Compétence 24"},null,{"$f":"Activité1!I31","v":0},{"$f":"Activité2!A31","v":"Act2 - Compétence 24"},null,null,null,{"$f":"Activité2!I31","v":0},{"$f":"Activité3!A31","v":"Act3 - Compétence 24"},null,null,null,{"$f":"Activité3!I31","v":0}]
[{"$f":"Activité1!A32","v":"Act1 - Compétence 25"},null,{"$f":"Activité1!I32","v":0},{"$f":"Activité2!A32","v":"Act2 - Compétence 25"},null,null,null,{"$f":"Activité2!I32","v":0},{"$f":"Activité3!A32","v":"Act3 - Compétence 25"},null,null,null,{"$f":"Activité3!I32","v":0}]
[]
[]
["Note proposée sur 20 (0,5 pts)",null,{"$f":"Activité1!I35","v":"Note"},null,null,null,null,{"$f":"Activité2!I35","v":"Note"},null,null,null,null,{"$f":"Activité3!I35","v":"Note"}]
[]
["Note avec coef",null,{"$f":"Activité1!I37","v":""},null,null,null,null,{"$f":"Activité2!I37","v":""},null,null,null,null,{"$f":"Activité3!I37","v":""}]

{"sheet":"FicheApp09","index":12,"n_rows":37,"n_cols":13,"rows_kept":37,"cut":false,"hidden":false,"merged":[[31,0,31,1],[31,3,31,6],[31,8,31,11],[29,0,29,1],[29,3,29,6],[29,8,29,11],[30,0,30,1],[30,3,30,6],[30,8,30,11],[27,0,27,1],[27,3,27,6],[27,8,27,11],[28,0,28,1],[28,3,28,6],[28,8,28,11],[25,0,25,1],[25,3,25,6],[25,8,25,11],[26,0,26,1],[26,3,26,6],[26,8,26,11],[23,0,23,1],[23,3,23,6],[23,8,23,11],[24,0,24,1],[24,3,24,6],[24,8,24,11],[21,0,21,1],[21,3,21,6],[21,8,21,11],[22,0,22,1],[22,3,22,6],[22,8,22,11],[19,0,19,1],[19,3,19,6],[19,8,19,11],[20,0,20,1],[20,3,20,6],[20,8,20,11],[17,0,17,1],[17,3,17,6],[17,8,17,11],[18,0,18,1],[18,3,18,6],[18,8,18,11],[15,0,15,1],[15,3,15,6],[15,8,15,11],[16,0,16,1],[16,3,16,6],[16,8,16,11],[13,0,13,1],[13,3,13,6],[13,8,13,11],[14,0,14,1],[14,3,14,6],[14,8,14,11],[11,0,11,1],[11,3,11,6],[11,8,11,11],[12,0,12,1],[12,3,12,6],[12,8,12,11],[9,0,9,1],[9,3,9,6],[9,8,9,11],[10,0,10,1],[10,3,10,6],[10,8,10,11],[7,0,7,1],[7,3,7,6],[7,8,7,11],[8,0,8,1],[8,3,8,6],[8,8,8,11],[5,0,6,2],[5,3,6,6],[5,8,6,12],[1,1,1,4],[2,1,2,4],[4,0,4,2],[4,3,4,7],[4,8,4,12]]}
["Etablissement ",{"$f":"IF(ISBLANK(Présentation!B4),\"\",Présentation!B4)","v":"Nom de l'établissement"},null,null,null,null,null,"Codes à saisir >",0,1,2,3,4]
["Diplôme",{"$f":"IF(ISBLANK(Présentation!B5),\"\",Présentation!B5)","v":"Seconde professionnelle [F] MHR"},null,null,null,null,null,"Signification","Non fait","Non maîtrisé","Insuffisamment maîtrisé","Maîtrise satisfaisante","Très bonne maîtrise"]
["Nom de l'apprenant",{"$f":"IF(ISBLANK(Présentation!$K11),\"\",Présentation!$K11)","v":"N&P Apprenant 9"},null,null,null,null,null,"Indication visuelle",0,1,2,3,4]
[]
["Epreuve 1",null,null,"Epreuve 2",null,null,null,null,"Epreuve 3"]
[{"$f":"(IF(ISBLANK(Présentation!B7),\"\",Présentation!B7))","v":"Titre activité 1"},null,null,{"$f":"IF(ISBLANK(Présentation!B8),\"\",Présentation!B8)","v":"Titre activité 2"},null,null,null,null,{"$f":"IF(ISBLANK(Présentation!B9),\"\",Présentation!B9)","v":"Titre activité 3"}]
[]
[{"$f":"Activité1!A8","v":"Act1 - Compétence 1 sur trois lignes pour impression"},null,{"$f":"Activité1!J8","v":0},{"$f":"Activité2!A8","v":"Act2 - Compétence 1 sur trois lignes pour impression"},null,null,null,{"$f":"Activité2!J8","v":0},{"$f":"Activité3!A8","v":"Act3 - Compétence 1 sur trois lignes pour impression"},null,null,null,{"$f":"Activité3!J8","v":0}]
[{"$f":"Activité1!A9","v":"Act1 - Compétence 2"},null,{"$f":"Activité1!J9","v":0},{"$f":"Activité2!A9","v":"Act2 - Compétence 2"},null,null,null,{"$f":"Activité2!J9","v":0},{"$f":"Activité3!A9","v":"Act3 - Compétence 2"},null,null,null,{"$f":"Activité3!J9","v":0}]
[{"$f":"Activité1!A10","v":"Act1 - Compétence 3"},null,{"$f":"Activité1!J10","v":0},{"$f":"Activité2!A10","v":"Act2 - Compétence 3"},null,null,null,{"$f":"Activité2!J10","v":0},{"$f":"Activité3!A10","v":"Act3 - Compétence 3"},null,null,null,{"$f":"Activité3!J10","v":0}]
[{"$f":"Activité1!A11","v":"Act1 - Compétence 4"},null,{"$f":"Activité1!J11","v":0},{"$f":"Activité2!A11","v":"Act2 - Compétence 4"},null,null,null,{"$f":"Activité2!J11","v":0},{"$f":"Activité3!A11","v":"Act3 - Compétence 4"},null,null,null,{"$f":"Activité3!J11","v":0}]
[{"$f":"Activité1!A12","v":"Act1 - Compétence 5"},null,{"$f":"Activité1!J12","v":0},{"$f":"Activité2!A12","v":"Act2 - Compétence 5"},null,null,null,{"$f":"Activité2!J12","v":0},{"$f":"Activité3!A12","v":"Act3 - Compétence 5"},null,null,null,{"$f":"Activité3!J12","v":0}]
[{"$f":"Activité1!A13","v":"Act1 - Compétence 6"},null,{"$f":"Activité1!J13","v":0},{"$f":"Activité2!A13","v":"Act2 - Compétence 6"},null,null,null,{"$f":"Activité2!J13","v":0},{"$f":"Activité3!A13","v":"Act3 - Compétence 6"},null,null,null,{"$f":"Activité3!J13","v":0}]
[{"$f":"Activité1!A14","v":"Act1 - Compétence 7"},null,{"$f":"Activité1!J14","v":0},{"$f":"Activité2!A14","v":"Act2 - Compétence 7"},null,null,null,{"$f":"Activité2!J14","v":0},{"$f":"Activité3!A14","v":"Act3 - Compétence 7"},null,null,null,{"$f":"Activité3!J14","v":0}]
[{"$f":"Activité1!A15","v":"Act1 - Compétence 8"},null,{"$f":"Activité1!J15","v":0},{"$f":"Activité2!A15","v":"Act2 - Compétence 8"},null,null,null,{"$f":"Activité2!J15","v":0},{"$f":"Activité3!A15","v":"Act3 - Compétence 8"},null,null,null,{"$f":"Activité3!J15","v":0}]
[{"$f":"Activité1!A16","v":"Act1 - Compétence 9"},null,{"$f":"Activité1!J16","v":0},{"$f":"Activité2!A16","v":"Act2 - Compétence 9"},null,null,null,{"$f":"Activité2!J16","v":0},{"$f":"Activité3!A16","v":"Act3 - Compétence 9"},null,null,null,{"$f":"Activité3!J16","v":0}]
[{"$f":"Activité1!A17","v":"Act1 - Compétence 10"},null,{"$f":"Activité1!J17","v":0},{"$f":"Activité2!A17","v":"Act2 - Compétence 10"},null,null,null,{"$f":"Activité2!J17","v":0},{"$f":"Activité3!A17","v":"Act3 - Compétence 10"},null,null,null,{"$f":"Activité3!J17","v":0}]
[{"$f":"Activité1!A18","v":"Act1 - Compétence 11"},null,{"$f":"Activité1!J18","v":0},{"$f":"Activité2!A18","v":"Act2 - Compétence 11"},null,null,null,{"$f":"Activité2!J18","v":0},{"$f":"Activité3!A18","v":"Act3 - Compétence 11"},null,null,null,{"$f":"Activité3!J18","v":0}]
[{"$f":"Activité1!A19","v":"Act1 - Compétence 12"},null,{"$f":"Activité1!J19","v":0},{"$f":"Activité2!A19","v":"Act2 - Compétence 12"},null,null,null,{"$f":"Activité2!J19","v":0},{"$f":"Activité3!A19","v":"Act3 - Compétence 12"},null,null,null,{"$f":"Activité3!J19","v":0}]
[{"$f":"Activité1!A20","v":"Act1 - Compétence 13"},null,{"$f":"Activité1!J20","v":0},{"$f":"Activité2!A20","v":"Act2 - Compétence 13"},null,null,null,{"$f":"Activité2!J20","v":0},{"$f":"Activité3!A20","v":"Act3 - Compétence 13"},null,null,null,{"$f":"Activité3!J20","v":0}]
[{"$f":"Activité1!A21","v":"Act1 - Compétence 14"},null,{"$f":"Activité1!J21","v":0},{"$f":"Activité2!A21","v":"Act2 - Compétence 14"},null,null,null,{"$f":"Activité2!J21","v":0},{"$f":"Activité3!A21","v":"Act3 - Compétence 14"},null,null,null,{"$f":"Activité3!J21","v":0}]
[{"$f":"Activité1!A22","v":"Act1 - Compétence 15"},null,{"$f":"Activité1!J22","v":0},{"$f":"Activité2!A22","v":"Act2 - Compétence 15"},null,null,null,{"$f":"Activité2!J22","v":0},{"$f":"Activité3!A22","v":"Act3 - Compétence 15"},null,null,null,{"$f":"Activité3!J22","v":0}]
[{"$f":"Activité1!A23","v":"Act1 - Compétence 16"},null,{"$f":"Activité1!J23","v":0},{"$f":"Activité2!A23","v":"Act2 - Compétence 16"},null,null,null,{"$f":"Activité2!J23","v":0},{"$f":"Activité3!A23","v":"Act3 - Compétence 16"},null,null,null,{"$f":"Activité3!J23","v":0}]
[{"$f":"Activité1!A24","v":"Act1 - Compétence 17"},null,{"$f":"Activité1!J24","v":0},{"$f":"Activité2!A24","v":"Act2 - Compétence 17"},null,null,null,{"$f":"Activité2!J24","v":0},{"$f":"Activité3!A24","v":"Act3 - Compétence 17"},null,null,null,{"$f":"Activité3!J24","v":0}]
[{"$f":"Activité1!A25","v":"Act1 - Compétence 18"},null,{"$f":"Activité1!J25","v":0},{"$f":"Activité2!A25","v":"Act2 - Compétence 18"},null,null,null,{"$f":"Activité2!J25","v":0},{"$f":"Activité3!A25","v":"Act3 - Compétence 18"},null,null,null,{"$f":"Activité3!J25","v":0}]
[{"$f":"Activité1!A26","v":"Act1 - Compétence 19"},null,{"$f":"Activité1!J26","v":0},{"$f":"Activité2!A26","v":"Act2 - Compétence 19"},null,null,null,{"$f":"Activité2!J26","v":0},{"$f":"Activité3!A26","v":"Act3 - Compétence 19"},null,null,null,{"$f":"Activité3!J26","v":0}]
[{"$f":"Activité1!A27","v":"Act1 - Compétence 20"},null,{"$f":"Activité1!J27","v":0},{"$f":"Activité2!A27","v":"Act2 - Compétence 20"},null,null,null,{"$f":"Activité2!J27","v":0},{"$f":"Activité3!A27","v":"Act3 - Compétence 20"},null,null,null,{"$f":"Activité3!J27","v":0}]
[{"$f":"Activité1!A28","v":"Act1 - Compétence 21"},null,{"$f":"Activité1!J28","v":0},{"$f":"Activité2!A28","v":"Act2 - Compétence 21"},null,null,null,{"$f":"Activité2!J28","v":0},{"$f":"Activité3!A28","v":"Act3 - Compétence 21"},null,null,null,{"$f":"Activité3!J28","v":0}]
[{"$f":"Activité1!A29","v":"Act1 - Compétence 22"},null,{"$f":"Activité1!J29","v":0},{"$f":"Activité2!A29","v":"Act2 - Compétence 22"},null,null,null,{"$f":"Activité2!J29","v":0},{"$f":"Activité3!A29","v":"Act3 - Compétence 22"},null,null,null,{"$f":"Activité3!J29","v":0}]
[{"$f":"Activité1!A30","v":"Act1 - Compétence 23"},null,{"$f":"Activité1!J30","v":0},{"$f":"Activité2!A30","v":"Act2 - Compétence 23"},null,null,null,{"$f":"Activité2!J30","v":0},{"$f":"Activité3!A30","v":"Act3 - Compétence 23"},null,null,null,{"$f":"Activité3!J30","v":0}]
[{"$f":"Activité1!A31","v":"Act1 - Compétence 24"},null,{"$f":"Activité1!J31","v":0},{"$f":"Activité2!A31","v":"Act2 - Compétence 24"},null,null,null,{"$f":"Activité2!J31","v":0},{"$f":"Activité3!A31","v":"Act3 - Compétence 24"},null,null,null,{"$f":"Activité3!J31","v":0}]
[{"$f":"Activité1!A32","v":"Act1 - Compétence 25"},null,{"$f":"Activité1!J32","v":0},{"$f":"Activité2!A32","v":"Act2 - Compétence 25"},null,null,null,{"$f":"Activité2!J32","v":0},{"$f":"Activité3!A32","v":"Act3 - Compétence 25"},null,null,null,{"$f":"Activité3!J32","v":0}]
[]
[]
["Note proposée sur 20 (0,5 pts)",null,{"$f":"Activité1!J35","v":"Note"},null,null,null,null,{"$f":"Activité2!J35","v":"Note"},null,null,null,null,{"$f":"Activité3!J35","v":"Note"}]
[]
["Note avec coef",null,{"$f":"Activité1!J37","v":""},null,null,null,null,{"$f":"Activité2!J37","v":""},null,null,null,null,{"$f":"Activité3!J37","v":""}]

{"sheet":"FicheApp10","index":13,"n_rows":37,"n_cols":13,"rows_kept":37,"cut":false,"hidden":false,"merged":[[31,0,31,1],[31,3,31,6],[31,8,31,11],[29,0,29,1],[29,3,29,6],[29,8,29,11],[30,0,30,1],[30,3,30,6],[30,8,30,11],[27,0,27,1],[27,3,27,6],[27,8,27,11],[28,0,28,1],[28,3,28,6],[28,8,28,11],[25,0,25,1],[25,3,25,6],[25,8,25,11],[26,0,26,1],[26,3,26,6],[26,8,26,11],[23,0,23,1],[23,3,23,6],[23,8,23,11],[24,0,24,1],[24,3,24,6],[24,8,24,11],[21,0,21,1],[21,3,21,6],[21,8,21,11],[22,0,22,1],[22,3,22,6],[22,8,22,11],[19,0,19,1],[19,3,19,6],[19,8,19,11],[20,0,20,1],[20,3,20,6],[20,8,20,11],[17,0,17,1],[17,3,17,6],[17,8,17,11],[18,0,18,1],[18,3,18,6],[18,8,18,11],[15,0,15,1],[15,3,15,6],[15,8,15,11],[16,0,16,1],[16,3,16,6],[16,8,16,11],[13,0,13,1],[13,3,13,6],[13,8,13,11],[14,0,14,1],[14,3,14,6],[14,8,14,11],[11,0,11,1],[11,3,11,6],[11,8,11,11],[12,0,12,1],[12,3,12,6],[12,8,12,11],[9,0,9,1],[9,3,9,6],[9,8,9,11],[10,0,10,1],[10,3,10,6],[10,8,10,11],[7,0,7,1],[7,3,7,6],[7,8,7,11],[8,0,8,1],[8,3,8,6],[8,8,8,11],[5,0,6,2],[5,3,6,6],[5,8,6,12],[1,1,1,4],[2,1,2,4],[4,0,4,2],[4,3,4,7],[4,8,4,12]]}
["Etablissement ",{"$f":"IF(ISBLANK(Présentation!B4),\"\",Présentation!B4)","v":"Nom de l'établissement"},null,null,null,null,null,"Codes à saisir >",0,1,2,3,4]
["Diplôme",{"$f":"IF(ISBLANK(Présentation!B5),\"\",Présentation!B5)","v":"Seconde professionnelle [F] MHR"},null,null,null,null,null,"Signification","Non fait","Non maîtrisé","Insuffisamment maîtrisé","Maîtrise satisfaisante","Très bonne maîtrise"]
["Nom de l'apprenant",{"$f":"IF(ISBLANK(Présentation!$K12),\"\",Présentation!$K12)","v":"N&P Apprenant 10"},null,null,null,null,null,"Indication visuelle",0,1,2,3,4]
[]
["Epreuve 1",null,null,"Epreuve 2",null,null,null,null,"Epreuve 3"]
[{"$f":"(IF(ISBLANK(Présentation!B7),\"\",Présentation!B7))","v":"Titre activité 1"},null,null,{"$f":"IF(ISBLANK(Présentation!B8),\"\",Présentation!B8)","v":"Titre activité 2"},null,null,null,null,{"$f":"IF(ISBLANK(Présentation!B9),\"\",Présentation!B9)","v":"Titre activité 3"}]
[]
[{"$f":"Activité1!A8","v":"Act1 - Compétence 1 sur trois lignes pour impression"},null,{"$f":"Activité1!K8","v":0},{"$f":"Activité2!A8","v":"Act2 - Compétence 1 sur trois lignes pour impression"},null,null,null,{"$f":"Activité2!K8","v":0},{"$f":"Activité3!A8","v":"Act3 - Compétence 1 sur trois lignes pour impression"},null,null,null,{"$f":"Activité3!K8","v":0}]
[{"$f":"Activité1!A9","v":"Act1 - Compétence 2"},null,{"$f":"Activité1!K9","v":0},{"$f":"Activité2!A9","v":"Act2 - Compétence 2"},null,null,null,{"$f":"Activité2!K9","v":0},{"$f":"Activité3!A9","v":"Act3 - Compétence 2"},null,null,null,{"$f":"Activité3!K9","v":0}]
[{"$f":"Activité1!A10","v":"Act1 - Compétence 3"},null,{"$f":"Activité1!K10","v":0},{"$f":"Activité2!A10","v":"Act2 - Compétence 3"},null,null,null,{"$f":"Activité2!K10","v":0},{"$f":"Activité3!A10","v":"Act3 - Compétence 3"},null,null,null,{"$f":"Activité3!K10","v":0}]
[{"$f":"Activité1!A11","v":"Act1 - Compétence 4"},null,{"$f":"Activité1!K11","v":0},{"$f":"Activité2!A11","v":"Act2 - Compétence 4"},null,null,null,{"$f":"Activité2!K11","v":0},{"$f":"Activité3!A11","v":"Act3 - Compétence 4"},null,null,null,{"$f":"Activité3!K11","v":0}]
[{"$f":"Activité1!A12","v":"Act1 - Compétence 5"},null,{"$f":"Activité1!K12","v":0},{"$f":"Activité2!A12","v":"Act2 - Compétence 5"},null,null,null,{"$f":"Activité2!K12","v":0},{"$f":"Activité3!A12","v":"Act3 - Compétence 5"},null,null,null,{"$f":"Activité3!K12","v":0}]
[{"$f":"Activité1!A13","v":"Act1 - Compétence 6"},null,{"$f":"Activité1!K13","v":0},{"$f":"Activité2!A13","v":"Act2 - Compétence 6"},null,null,null,{"$f":"Activité2!K13","v":0},{"$f":"Activité3!A13","v":"Act3 - Compétence 6"},null,null,null,{"$f":"Activité3!K13","v":0}]
[{"$f":"Activité1!A14","v":"Act1 - Compétence 7"},null,{"$f":"Activité1!K14","v":0},{"$f":"Activité2!A14","v":"Act2 - Compétence 7"},null,null,null,{"$f":"Activité2!K14","v":0},{"$f":"Activité3!A14","v":"Act3 - Compétence 7"},null,null,null,{"$f":"Activité3!K14","v":0}]
[{"$f":"Activité1!A15","v":"Act1 - Compétence 8"},null,{"$f":"Activité1!K15","v":0},{"$f":"Activité2!A15","v":"Act2 - Compétence 8"},null,null,null,{"$f":"Activité2!K15","v":0},{"$f":"Activité3!A15","v":"Act3 - Compétence 8"},null,null,null,{"$f":"Activité3!K15","v":0}]
[{"$f":"Activité1!A16","v":"Act1 - Compétence 9"},null,{"$f":"Activité1!K16","v":0},{"$f":"Activité2!A16","v":"Act2 - Compétence 9"},null,null,null,{"$f":"Activité2!K16","v":0},{"$f":"Activité3!A16","v":"Act3 - Compétence 9"},null,null,null,{"$f":"Activité3!K16","v":0}]
[{"$f":"Activité1!A17","v":"Act1 - Compétence 10"},null,{"$f":"Activité1!K17","v":0},{"$f":"Activité2!A17","v":"Act2 - Compétence 10"},null,null,null,{"$f":"Activité2!K17","v":0},{"$f":"Activité3!A17","v":"Act3 - Compétence 10"},null,null,null,{"$f":"Activité3!K17","v":0}]
[{"$f":"Activité1!A18","v":"Act1 - Compétence 11"},null,{"$f":"Activité1!K18","v":0},{"$f":"Activité2!A18","v":"Act2 - Compétence 11"},null,null,null,{"$f":"Activité2!K18","v":0},{"$f":"Activité3!A18","v":"Act3 - Compétence 11"},null,null,null,{"$f":"Activité3!K18","v":0}]
[{"$f":"Activité1!A19","v":"Act1 - Compétence 12"},null,{"$f":"Activité1!K19","v":0},{"$f":"Activité2!A19","v":"Act2 - Compétence 12"},null,null,null,{"$f":"Activité2!K19","v":0},{"$f":"Activité3!A19","v":"Act3 - Compétence 12"},null,null,null,{"$f":"Activité3!K19","v":0}]
[{"$f":"Activité1!A20","v":"Act1 - Compétence 13"},null,{"$f":"Activité1!K20","v":0},{"$f":"Activité2!A20","v":"Act2 - Compétence 13"},null,null,null,{"$f":"Activité2!K20","v":0},{"$f":"Activité3!A20","v":"Act3 - Compétence 13"},null,null,null,{"$f":"Activité3!K20","v":0}]
[{"$f":"Activité1!A21","v":"Act1 - Compétence 14"},null,{"$f":"Activité1!K21","v":0},{"$f":"Activité2!A21","v":"Act2 - Compétence 14"},null,null,null,{"$f":"Activité2!K21","v":0},{"$f":"Activité3!A21","v":"Act3 - Compétence 14"},null,null,null,{"$f":"Activité3!K21","v":0}]
[{"$f":"Activité1!A22","v":"Act1 - Compétence 15"},null,{"$f":"Activité1!K22","v":0},{"$f":"Activité2!A22","v":"Act2 - Compétence 15"},null,null,null,{"$f":"Activité2!K22","v":0},{"$f":"Activité3!A22","v":"Act3 - Compétence 15"},null,null,null,{"$f":"Activité3!K22","v":0}]
[{"$f":"Activité1!A23","v":"Act1 - Compétence 16"},null,{"$f":"Activité1!K23","v":0},{"$f":"Activité2!A23","v":"Act2 - Compétence 16"},null,null,null,{"$f":"Activité2!K23","v":0},{"$f":"Activité3!A23","v":"Act3 - Compétence 16"},null,null,null,{"$f":"Activité3!K23","v":0}]
[{"$f":"Activité1!A24","v":"Act1 - Compétence 17"},null,{"$f":"Activité1!K24","v":0},{"$f":"Activité2!A24","v":"Act2 - Compétence 17"},null,null,null,{"$f":"Activité2!K24","v":0},{"$f":"Activité3!A24","v":"Act3 - Compétence 17"},null,null,null,{"$f":"Activité3!K24","v":0}]
[{"$f":"Activité1!A25","v":"Act1 - Compétence 18"},null,{"$f":"Activité1!K25","v":0},{"$f":"Activité2!A25","v":"Act2 - Compétence 18"},null,null,null,{"$f":"Activité2!K25","v":0},{"$f":"Activité3!A25","v":"Act3 - Compétence 18"},null,null,null,{"$f":"Activité3!K25","v":0}]
[{"$f":"Activité1!A26","v":"Act1 - Compétence 19"},null,{"$f":"Activité1!K26","v":0},{"$f":"Activité2!A26","v":"Act2 - Compétence 19"},null,null,null,{"$f":"Activité2!K26","v":0},{"$f":"Activité3!A26","v":"Act3 - Compétence 19"},null,null,null,{"$f":"Activité3!K26","v":0}]
[{"$f":"Activité1!A27","v":"Act1 - Compétence 20"},null,{"$f":"Activité1!K27","v":0},{"$f":"Activité2!A27","v":"Act2 - Compétence 20"},null,null,null,{"$f":"Activité2!K27","v":0},{"$f":"Activité3!A27","v":"Act3 - Compétence 20"},null,null,null,{"$f":"Activité3!K27","v":0}]
[{"$f":"Activité1!A28","v":"Act1 - Compétence 21"},null,{"$f":"Activité1!K28","v":0},{"$f":"Activité2!A28","v":"Act2 - Compétence 21"},null,null,null,{"$f":"Activité2!K28","v":0},{"$f":"Activité3!A28","v":"Act3 - Compétence 21"},null,null,null,{"$f":"Activité3!K28","v":0}]
[{"$f":"Activité1!A29","v":"Act1 - Compétence 22"},null,{"$f":"Activité1!K29","v":0},{"$f":"Activité2!A29","v":"Act2 - Compétence 22"},null,null,null,{"$f":"Activité2!K29","v":0},{"$f":"Activité3!A29","v":"Act3 - Compétence 22"},null,null,null,{"$f":"Activité3!K29","v":0}]
[{"$f":"Activité1!A30","v":"Act1 - Compétence 23"},null,{"$f":"Activité1!K30","v":0},{"$f":"Activité2!A30","v":"Act2 - Compétence 23"},null,null,null,{"$f":"Activité2!K30","v":0},{"$f":"Activité3!A30","v":"Act3 - Compétence 23"},null,null,null,{"$f":"Activité3!K30","v":0}]
[{"$f":"Activité1!A31","v":"Act1 - Compétence 24"},null,{"$f":"Activité1!K31","v":0},{"$f":"Activité2!A31","v":"Act2 - Compétence 24"},null,null,null,{"$f":"Activité2!K31","v":0},{"$f":"Activité3!A31","v":"Act3 - Compétence 24"},null,null,null,{"$f":"Activité3!K31","v":0}]
[{"$f":"Activité1!A32","v":"Act1 - Compétence 25"},null,{"$f":"Activité1!K32","v":0},{"$f":"Activité2!A32","v":"Act2 - Compétence 25"},null,null,null,{"$f":"Activité2!K32","v":0},{"$f":"Activité3!A32","v":"Act3 - Compétence 25"},null,null,null,{"$f":"Activité3!K32","v":0}]
[]
[]
["Note proposée sur 20 (0,5 pts)",null,{"$f":"Activité1!K35","v":"Note"},null,null,null,null,{"$f":"Activité2!K35","v":"Note"},null,null,null,null,{"$f":"Activité3!K35","v":"Note"}]
[]
["Note avec coef",null,{"$f":"Activité1!K37","v":""},null,null,null,null,{"$f":"Activité2!K37","v":""},null,null,null,null,{"$f":"Activité3!K37","v":""}]

{"sheet":"FicheApp11","index":14,"n_rows":37,"n_cols":13,"rows_kept":37,"cut":false,"hidden":false,"merged":[[31,0,31,1],[31,3,31,6],[31,8,31,11],[29,0,29,1],[29,3,29,6],[29,8,29,11],[30,0,30,1],[30,3,30,6],[30,8,30,11],[27,0,27,1],[27,3,27,6],[27,8,27,11],[28,0,28,1],[28,3,28,6],[28,8,28,11],[25,0,25,1],[25,3,25,6],[25,8,25,11],[26,0,26,1],[26,3,26,6],[26,8,26,11],[23,0,23,1],[23,3,23,6],[23,8,23,11],[24,0,24,1],[24,3,24,6],[24,8,24,11],[21,0,21,1],[21,3,21,6],[21,8,21,11],[22,0,22,1],[22,3,22,6],[22,8,22,11],[19,0,19,1],[19,3,19,6],[19,8,19,11],[20,0,20,1],[20,3,20,6],[20,8,20,11],[17,0,17,1],[17,3,17,6],[17,8,17,11],[18,0,18,1],[18,3,18,6],[18,8,18,11],[15,0,15,1],[15,3,15,6],[15,8,15,11],[16,0,16,1],[16,3,16,6],[16,8,16,11],[13,0,13,1],[13,3,13,6],[13,8,13,11],[14,0,14,1],[14,3,14,6],[14,8,14,11],[11,0,11,1],[11,3,11,6],[11,8,11,11],[12,0,12,1],[12,3,12,6],[12,8,12,11],[9,0,9,1],[9,3,9,6],[9,8,9,11],[10,0,10,1],[10,3,10,6],[10,8,10,11],[7,0,7,1],[7,3,7,6],[7,8,7,11],[8,0,8,1],[8,3,8,6],[8,8,8,11],[5,0,6,2],[5,3,6,6],[5,8,6,12],[1,1,1,4],[2,1,2,4],[4,0,4,2],[4,3,4,7],[4,8,4,12]]}
["Etablissement ",{"$f":"IF(ISBLANK(Présentation!B4),\"\",Présentation!B4)","v":"Nom de l'établissement"},null,null,null,null,null,"Codes à saisir >",0,1,2,3,4]
["Diplôme",{"$f":"IF(ISBLANK(Présentation!B5),\"\",Présentation!B5)","v":"Seconde professionnelle [F] MHR"},null,null,null,null,null,"Signification","Non fait","Non maîtrisé","Insuffisamment maîtrisé","Maîtrise satisfaisante","Très bonne maîtrise"]
["Nom de l'apprenant",{"$f":"IF(ISBLANK(Présentation!$K13),\"\",Présentation!$K13)","v":"N&P Apprenant 11"},null,null,null,null,null,"Indication visuelle",0,1,2,3,4]
[]
["Epreuve 1",null,null,"Epreuve 2",null,null,null,null,"Epreuve 3"]
[{"$f":"(IF(ISBLANK(Présentation!B7),\"\",Présentation!B7))","v":"Titre activité 1"},null,null,{"$f":"IF(ISBLANK(Présentation!B8),\"\",Présentation!B8)","v":"Titre activité 2"},null,null,null,null,{"$f":"IF(ISBLANK(Présentation!B9),\"\",Présentation!B9)","v":"Titre activité 3"}]
[]
[{"$f":"Activité1!A8","v":"Act1 - Compétence 1 sur trois lignes pour impression"},null,{"$f":"Activité1!L8","v":0},{"$f":"Activité2!A8","v":"Act2 - Compétence 1 sur trois lignes pour impression"},null,null,null,{"$f":"Activité2!L8","v":0},{"$f":"Activité3!A8","v":"Act3 - Compétence 1 sur trois lignes pour impression"},null,null,null,{"$f":"Activité3!L8","v":0}]
[{"$f":"Activité1!A9","v":"Act1 - Compétence 2"},null,{"$f":"Activité1!L9","v":0},{"$f":"Activité2!A9","v":"Act2 - Compétence 2"},null,null,null,{"$f":"Activité2!L9","v":0},{"$f":"Activité3!A9","v":"Act3 - Compétence 2"},null,null,null,{"$f":"Activité3!L9","v":0}]
[{"$f":"Activité1!A10","v":"Act1 - Compétence 3"},null,{"$f":"Activité1!L10","v":0},{"$f":"Activité2!A10","v":"Act2 - Compétence 3"},null,null,null,{"$f":"Activité2!L10","v":0},{"$f":"Activité3!A10","v":"Act3 - Compétence 3"},null,null,null,{"$f":"Activité3!L10","v":0}]
[{"$f":"Activité1!A11","v":"Act1 - Compétence 4"},null,{"$f":"Activité1!L11","v":0},{"$f":"Activité2!A11","v":"Act2 - Compétence 4"},null,null,null,{"$f":"Activité2!L11","v":0},{"$f":"Activité3!A11","v":"Act3 - Compétence 4"},null,null,null,{"$f":"Activité3!L11","v":0}]
[{"$f":"Activité1!A12","v":"Act1 - Compétence 5"},null,{"$f":"Activité1!L12","v":0},{"$f":"Activité2!A12","v":"Act2 - Compétence 5"},null,null,null,{"$f":"Activité2!L12","v":0},{"$f":"Activité3!A12","v":"Act3 - Compétence 5"},null,null,null,{"$f":"Activité3!L12","v":0}]
[{"$f":"Activité1!A13","v":"Act1 - Compétence 6"},null,{"$f":"Activité1!L13","v":0},{"$f":"Activité2!A13","v":"Act2 - Compétence 6"},null,null,null,{"$f":"Activité2!L13","v":0},{"$f":"Activité3!A13","v":"Act3 - Compétence 6"},null,null,null,{"$f":"Activité3!L13","v":0}]
[{"$f":"Activité1!A14","v":"Act1 - Compétence 7"},null,{"$f":"Activité1!L14","v":0},{"$f":"Activité2!A14","v":"Act2 - Compétence 7"},null,null,null,{"$f":"Activité2!L14","v":0},{"$f":"Activité3!A14","v":"Act3 - Compétence 7"},null,null,null,{"$f":"Activité3!L14","v":0}]
[{"$f":"Activité1!A15","v":"Act1 - Compétence 8"},null,{"$f":"Activité1!L15","v":0},{"$f":"Activité2!A15","v":"Act2 - Compétence 8"},null,null,null,{"$f":"Activité2!L15","v":0},{"$f":"Activité3!A15","v":"Act3 - Compétence 8"},null,null,null,{"$f":"Activité3!L15","v":0}]
[{"$f":"Activité1!A16","v":"Act1 - Compétence 9"},null,{"$f":"Activité1!L16","v":0},{"$f":"Activité2!A16","v":"Act2 - Compétence 9"},null,null,null,{"$f":"Activité2!L16","v":0},{"$f":"Activité3!A16","v":"Act3 - Compétence 9"},null,null,null,{"$f":"Activité3!L16","v":0}]
[{"$f":"Activité1!A17","v":"Act1 - Compétence 10"},null,{"$f":"Activité1!L17","v":0},{"$f":"Activité2!A17","v":"Act2 - Compétence 10"},null,null,null,{"$f":"Activité2!L17","v":0},{"$f":"Activité3!A17","v":"Act3 - Compétence 10"},null,null,null,{"$f":"Activité3!L17","v":0}]
[{"$f":"Activité1!A18","v":"Act1 - Compétence 11"},null,{"$f":"Activité1!L18","v":0},{"$f":"Activité2!A18","v":"Act2 - Compétence 11"},null,null,null,{"$f":"Activité2!L18","v":0},{"$f":"Activité3!A18","v":"Act3 - Compétence 11"},null,null,null,{"$f":"Activité3!L18","v":0}]
[{"$f":"Activité1!A19","v":"Act1 - Compétence 12"},null,{"$f":"Activité1!L19","v":0},{"$f":"Activité2!A19","v":"Act2 - Compétence 12"},null,null,null,{"$f":"Activité2!L19","v":0},{"$f":"Activité3!A19","v":"Act3 - Compétence 12"},null,null,null,{"$f":"Activité3!L19","v":0}]
[{"$f":"Activité1!A20","v":"Act1 - Compétence 13"},null,{"$f":"Activité1!L20","v":0},{"$f":"Activité2!A20","v":"Act2 - Compétence 13"},null,null,null,{"$f":"Activité2!L20","v":0},{"$f":"Activité3!A20","v":"Act3 - Compétence 13"},null,null,null,{"$f":"Activité3!L20","v":0}]
[{"$f":"Activité1!A21","v":"Act1 - Compétence 14"},null,{"$f":"Activité1!L21","v":0},{"$f":"Activité2!A21","v":"Act2 - Compétence 14"},null,null,null,{"$f":"Activité2!L21","v":0},{"$f":"Activité3!A21","v":"Act3 - Compétence 14"},null,null,null,{"$f":"Activité3!L21","v":0}]
[{"$f":"Activité1!A22","v":"Act1 - Compétence 15"},null,{"$f":"Activité1!L22","v":0},{"$f":"Activité2!A22","v":"Act2 - Compétence 15"},null,null,null,{"$f":"Activité2!L22","v":0},{"$f":"Activité3!A22","v":"Act3 - Compétence 15"},null,null,null,{"$f":"Activité3!L22","v":0}]
[{"$f":"Activité1!A23","v":"Act1 - Compétence 16"},null,{"$f":"Activité1!L23","v":0},{"$f":"Activité2!A23","v":"Act2 - Compétence 16"},null,null,null,{"$f":"Activité2!L23","v":0},{"$f":"Activité3!A23","v":"Act3 - Compétence 16"},null,null,null,{"$f":"Activité3!L23","v":0}]
[{"$f":"Activité1!A24","v":"Act1 - Compétence 17"},null,{"$f":"Activité1!L24","v":0},{"$f":"Activité2!A24","v":"Act2 - Compétence 17"},null,null,null,{"$f":"Activité2!L24","v":0},{"$f":"Activité3!A24","v":"Act3 - Compétence 17"},null,null,null,{"$f":"Activité3!L24","v":0}]
[{"$f":"Activité1!A25","v":"Act1 - Compétence 18"},null,{"$f":"Activité1!L25","v":0},{"$f":"Activité2!A25","v":"Act2 - Compétence 18"},null,null,null,{"$f":"Activité2!L25","v":0},{"$f":"Activité3!A25","v":"Act3 - Compétence 18"},null,null,null,{"$f":"Activité3!L25","v":0}]
[{"$f":"Activité1!A26","v":"Act1 - Compétence 19"},null,{"$f":"Activité1!L26","v":0},{"$f":"Activité2!A26","v":"Act2 - Compétence 19"},null,null,null,{"$f":"Activité2!L26","v":0},{"$f":"Activité3!A26","v":"Act3 - Compétence 19"},null,null,null,{"$f":"Activité3!L26","v":0}]
[{"$f":"Activité1!A27","v":"Act1 - Compétence 20"},null,{"$f":"Activité1!L27","v":0},{"$f":"Activité2!A27","v":"Act2 - Compétence 20"},null,null,null,{"$f":"Activité2!L27","v":0},{"$f":"Activité3!A27","v":"Act3 - Compétence 20"},null,null,null,{"$f":"Activité3!L27","v":0}]
[{"$f":"Activité1!A28","v":"Act1 - Compétence 21"},null,{"$f":"Activité1!L28","v":0},{"$f":"Activité2!A28","v":"Act2 - Compétence 21"},null,null,null,{"$f":"Activité2!L28","v":0},{"$f":"Activité3!A28","v":"Act3 - Compétence 21"},null,null,null,{"$f":"Activité3!L28","v":0}]
[{"$f":"Activité1!A29","v":"Act1 - Compétence 22"},null,{"$f":"Activité1!L29","v":0},{"$f":"Activité2!A29","v":"Act2 - Compétence 22"},null,null,null,{"$f":"Activité2!L29","v":0},{"$f":"Activité3!A29","v":"Act3 - Compétence 22"},null,null,null,{"$f":"Activité3!L29","v":0}]
[{"$f":"Activité1!A30","v":"Act1 - Compétence 23"},null,{"$f":"Activité1!L30","v":0},{"$f":"Activité2!A30","v":"Act2 - Compétence 23"},null,null,null,{"$f":"Activité2!L30","v":0},{"$f":"Activité3!A30","v":"Act3 - Compétence 23"},null,null,null,{"$f":"Activité3!L30","v":0}]
[{"$f":"Activité1!A31","v":"Act1 - Compétence 24"},null,{"$f":"Activité1!L31","v":0},{"$f":"Activité2!A31","v":"Act2 - Compétence 24"},null,null,null,{"$f":"Activité2!L31","v":0},{"$f":"Activité3!A31","v":"Act3 - Compétence 24"},null,null,null,{"$f":"Activité3!L31","v":0}]
[{"$f":"Activité1!A32","v":"Act1 - Compétence 25"},null,{"$f":"Activité1!L32","v":0},{"$f":"Activité2!A32","v":"Act2 - Compétence 25"},null,null,null,{"$f":"Activité2!L32","v":0},{"$f":"Activité3!A32","v":"Act3 - Compétence 25"},null,null,null,{"$f":"Activité3!L32","v":0}]
[]
[]
["Note proposée sur 20 (0,5 pts)",null,{"$f":"Activité1!L35","v":"Note"},null,null,null,null,{"$f":"Activité2!L35","v":"Note"},null,null,null,null,{"$f":"Activité3!L35","v":"Note"}]
[]
["Note avec coef",null,{"$f":"Activité1!L37","v":""},null,null,null,null,{"$f":"Activité2!L37","v":""},null,null,null,null,{"$f":"Activité3!L37","v":""}]

{"sheet":"FicheApp12","index":15,"n_rows":37,"n_cols":13,"rows_kept":37,"cut":false,"hidden":false,"merged":[[31,0,31,1],[31,3,31,6],[31,8,31,11],[29,0,29,1],[29,3,29,6],[29,8,29,11],[30,0,30,1],[30,3,30,6],[30,8,30,11],[27,0,27,1],[27,3,27,6],[27,8,27,11],[28,0,28,1],[28,3,28,6],[28,8,28,11],[25,0,25,1],[25,3,25,6],[25,8,25,11],[26,0,26,1],[26,3,26,6],[26,8,26,11],[23,0,23,1],[23,3,23,6],[23,8,23,11],[24,0,24,1],[24,3,24,6],[24,8,24,11],[21,0,21,1],[21,3,21,6],[21,8,21,11],[22,0,22,1],[22,3,22,6],[22,8,22,11],[19,0,19,1],[19,3,19,6],[19,8,19,11],[20,0,20,1],[20,3,20,6],[20,8,20,11],[17,0,17,1],[17,3,17,6],[17,8,17,11],[18,0,18,1],[18,3,18,6],[18,8,18,11],[15,0,15,1],[15,3,15,6],[15,8,15,11],[16,0,16,1],[16,3,16,6],[16,8,16,11],[13,0,13,1],[13,3,13,6],[13,8,13,11],[14,0,14,1],[14,3,14,6],[14,8,14,11],[11,0,11,1],[11,3,11,6],[11,8,11,11],[12,0,12,1],[12,3,12,6],[12,8,12,11],[9,0,9,1],[9,3,9,6],[9,8,9,11],[10,0,10,1],[10,3,10,6],[10,8,10,11],[7,0,7,1],[7,3,7,6],[7,8,7,11],[8,0,8,1],[8,3,8,6],[8,8,8,11],[5,0,6,2],[5,3,6,6],[5,8,6,12],[1,1,1,4],[2,1,2,4],[4,0,4,2],[4,3,4,7],[4,8,4,12]]}
["Etablissement ",{"$f":"IF(ISBLANK(Présentation!B4),\"\",Présentation!B4)","v":"Nom de l'établissement"},null,null,null,null,null,"Codes à saisir >",0,1,2,3,4]
["Diplôme",{"$f":"IF(ISBLANK(Présentation!B5),\"\",Présentation!B5)","v":"Seconde professionnelle [F] MHR"},null,null,null,null,null,"Signification","Non fait","Non maîtrisé","Insuffisamment maîtrisé","Maîtrise satisfaisante","Très bonne maîtrise"]
["Nom de l'apprenant",{"$f":"IF(ISBLANK(Présentation!$K14),\"\",Présentation!$K14)","v":"N&P Apprenant 12"},null,null,null,null,null,"Indication visuelle",0,1,2,3,4]
[]
["Epreuve 1",null,null,"Epreuve 2",null,null,null,null,"Epreuve 3"]
[{"$f":"(IF(ISBLANK(Présentation!B7),\"\",Présentation!B7))","v":"Titre activité 1"},null,null,{"$f":"IF(ISBLANK(Présentation!B8),\"\",Présentation!B8)","v":"Titre activité 2"},null,null,null,null,{"$f":"IF(ISBLANK(Présentation!B9),\"\",Présentation!B9)","v":"Titre activité 3"}]
[]
[{"$f":"Activité1!A8","v":"Act1 - Compétence 1 sur trois lignes pour impression"},null,{"$f":"Activité1!M8","v":0},{"$f":"Activité2!A8","v":"Act2 - Compétence 1 sur trois lignes pour impression"},null,null,null,{"$f":"Activité2!M8","v":0},{"$f":"Activité3!A8","v":"Act3 - Compétence 1 sur trois lignes pour impression"},null,null,null,{"$f":"Activité3!M8","v":0}]
[{"$f":"Activité1!A9","v":"Act1 - Compétence 2"},null,{"$f":"Activité1!M9","v":0},{"$f":"Activité2!A9","v":"Act2 - Compétence 2"},null,null,null,{"$f":"Activité2!M9","v":0},{"$f":"Activité3!A9","v":"Act3 - Compétence 2"},null,null,null,{"$f":"Activité3!M9","v":0}]
[{"$f":"Activité1!A10","v":"Act1 - Compétence 3"},null,{"$f":"Activité1!M10","v":0},{"$f":"Activité2!A10","v":"Act2 - Compétence 3"},null,null,null,{"$f":"Activité2!M10","v":0},{"$f":"Activité3!A10","v":"Act3 - Compétence 3"},null,null,null,{"$f":"Activité3!M10","v":0}]
[{"$f":"Activité1!A11","v":"Act1 - Compétence 4"},null,{"$f":"Activité1!M11","v":0},{"$f":"Activité2!A11","v":"Act2 - Compétence 4"},null,null,null,{"$f":"Activité2!M11","v":0},{"$f":"Activité3!A11","v":"Act3 - Compétence 4"},null,null,null,{"$f":"Activité3!M11","v":0}]
[{"$f":"Activité1!A12","v":"Act1 - Compétence 5"},null,{"$f":"Activité1!M12","v":0},{"$f":"Activité2!A12","v":"Act2 - Compétence 5"},null,null,null,{"$f":"Activité2!M12","v":0},{"$f":"Activité3!A12","v":"Act3 - Compétence 5"},null,null,null,{"$f":"Activité3!M12","v":0}]
[{"$f":"Activité1!A13","v":"Act1 - Compétence 6"},null,{"$f":"Activité1!M13","v":0},{"$f":"Activité2!A13","v":"Act2 - Compétence 6"},null,null,null,{"$f":"Activité2!M13","v":0},{"$f":"Activité3!A13","v":"Act3 - Compétence 6"},null,null,null,{"$f":"Activité3!M13","v":0}]
[{"$f":"Activité1!A14","v":"Act1 - Compétence 7"},null,{"$f":"Activité1!M14","v":0},{"$f":"Activité2!A14","v":"Act2 - Compétence 7"},null,null,null,{"$f":"Activité2!M14","v":0},{"$f":"Activité3!A14","v":"Act3 - Compétence 7"},null,null,null,{"$f":"Activité3!M14","v":0}]
[{"$f":"Activité1!A15","v":"Act1 - Compétence 8"},null,{"$f":"Activité1!M15","v":0},{"$f":"Activité2!A15","v":"Act2 - Compétence 8"},null,null,null,{"$f":"Activité2!M15","v":0},{"$f":"Activité3!A15","v":"Act3 - Compétence 8"},null,null,null,{"$f":"Activité3!M15","v":0}]
[{"$f":"Activité1!A16","v":"Act1 - Compétence 9"},null,{"$f":"Activité1!M16","v":0},{"$f":"Activité2!A16","v":"Act2 - Compétence 9"},null,null,null,{"$f":"Activité2!M16","v":0},{"$f":"Activité3!A16","v":"Act3 - Compétence 9"},null,null,null,{"$f":"Activité3!M16","v":0}]
[{"$f":"Activité1!A17","v":"Act1 - Compétence 10"},null,{"$f":"Activité1!M17","v":0},{"$f":"Activité2!A17","v":"Act2 - Compétence 10"},null,null,null,{"$f":"Activité2!M17","v":0},{"$f":"Activité3!A17","v":"Act3 - Compétence 10"},null,null,null,{"$f":"Activité3!M17","v":0}]
[{"$f":"Activité1!A18","v":"Act1 - Compétence 11"},null,{"$f":"Activité1!M18","v":0},{"$f":"Activité2!A18","v":"Act2 - Compétence 11"},null,null,null,{"$f":"Activité2!M18","v":0},{"$f":"Activité3!A18","v":"Act3 - Compétence 11"},null,null,null,{"$f":"Activité3!M18","v":0}]
[{"$f":"Activité1!A19","v":"Act1 - Compétence 12"},null,{"$f":"Activité1!M19","v":0},{"$f":"Activité2!A19","v":"Act2 - Compétence 12"},null,null,null,{"$f":"Activité2!M19","v":0},{"$f":"Activité3!A19","v":"Act3 - Compétence 12"},null,null,null,{"$f":"Activité3!M19","v":0}]
[{"$f":"Activité1!A20","v":"Act1 - Compétence 13"},null,{"$f":"Activité1!M20","v":0},{"$f":"Activité2!A20","v":"Act2 - Compétence 13"},null,null,null,{"$f":"Activité2!M20","v":0},{"$f":"Activité3!A20","v":"Act3 - Compétence 13"},null,null,null,{"$f":"Activité3!M20","v":0}]
[{"$f":"Activité1!A21","v":"Act1 - Compétence 14"},null,{"$f":"Activité1!M21","v":0},{"$f":"Activité2!A21","v":"Act2 - Compétence 14"},null,null,null,{"$f":"Activité2!M21","v":0},{"$f":"Activité3!A21","v":"Act3 - Compétence 14"},null,null,null,{"$f":"Activité3!M21","v":0}]
[{"$f":"Activité1!A22","v":"Act1 - Compétence 15"},null,{"$f":"Activité1!M22","v":0},{"$f":"Activité2!A22","v":"Act2 - Compétence 15"},null,null,null,{"$f":"Activité2!M22","v":0},{"$f":"Activité3!A22","v":"Act3 - Compétence 15"},null,null,null,{"$f":"Activité3!M22","v":0}]
[{"$f":"Activité1!A23","v":"Act1 - Compétence 16"},null,{"$f":"Activité1!M23","v":0},{"$f":"Activité2!A23","v":"Act2 - Compétence 16"},null,null,null,{"$f":"Activité2!M23","v":0},{"$f":"Activité3!A23","v":"Act3 - Compétence 16"},null,null,null,{"$f":"Activité3!M23","v":0}]
[{"$f":"Activité1!A24","v":"Act1 - Compétence 17"},null,{"$f":"Activité1!M24","v":0},{"$f":"Activité2!A24","v":"Act2 - Compétence 17"},null,null,null,{"$f":"Activité2!M24","v":0},{"$f":"Activité3!A24","v":"Act3 - Compétence 17"},null,null,null,{"$f":"Activité3!M24","v":0}]
[{"$f":"Activité1!A25","v":"Act1 - Compétence 18"},null,{"$f":"Activité1!M25","v":0},{"$f":"Activité2!A25","v":"Act2 - Compétence 18"},null,null,null,{"$f":"Activité2!M25","v":0},{"$f":"Activité3!A25","v":"Act3 - Compétence 18"},null,null,null,{"$f":"Activité3!M25","v":0}]
[{"$f":"Activité1!A26","v":"Act1 - Compétence 19"},null,{"$f":"Activité1!M26","v":0},{"$f":"Activité2!A26","v":"Act2 - Compétence 19"},null,null,null,{"$f":"Activité2!M26","v":0},{"$f":"Activité3!A26","v":"Act3 - Compétence 19"},null,null,null,{"$f":"Activité3!M26","v":0}]
[{"$f":"Activité1!A27","v":"Act1 - Compétence 20"},null,{"$f":"Activité1!M27","v":0},{"$f":"Activité2!A27","v":"Act2 - Compétence 20"},null,null,null,{"$f":"Activité2!M27","v":0},{"$f":"Activité3!A27","v":"Act3 - Compétence 20"},null,null,null,{"$f":"Activité3!M27","v":0}]
[{"$f":"Activité1!A28","v":"Act1 - Compétence 21"},null,{"$f":"Activité1!M28","v":0},{"$f":"Activité2!A28","v":"Act2 - Compétence 21"},null,null,null,{"$f":"Activité2!M28","v":0},{"$f":"Activité3!A28","v":"Act3 - Compétence 21"},null,null,null,{"$f":"Activité3!M28","v":0}]
[{"$f":"Activité1!A29","v":"Act1 - Compétence 22"},null,{"$f":"Activité1!M29","v":0},{"$f":"Activité2!A29","v":"Act2 - Compétence 22"},null,null,null,{"$f":"Activité2!M29","v":0},{"$f":"Activité3!A29","v":"Act3 - Compétence 22"},null,null,null,{"$f":"Activité3!M29","v":0}]
[{"$f":"Activité1!A30","v":"Act1 - Compétence 23"},null,{"$f":"Activité1!M30","v":0},{"$f":"Activité2!A30","v":"Act2 - Compétence 23"},null,null,null,{"$f":"Activité2!M30","v":0},{"$f":"Activité3!A30","v":"Act3 - Compétence 23"},null,null,null,{"$f":"Activité3!M30","v":0}]
[{"$f":"Activité1!A31","v":"Act1 - Compétence 24"},null,{"$f":"Activité1!M31","v":0},{"$f":"Activité2!A31","v":"Act2 - Compétence 24"},null,null,null,{"$f":"Activité2!M31","v":0},{"$f":"Activité3!A31","v":"Act3 - Compétence 24"},null,null,null,{"$f":"Activité3!M31","v":0}]
[{"$f":"Activité1!A32","v":"Act1 - Compétence 25"},null,{"$f":"Activité1!M32","v":0},{"$f":"Activité2!A32","v":"Act2 - Compétence 25"},null,null,null,{"$f":"Activité2!M32","v":0},{"$f":"Activité3!A32","v":"Act3 - Compétence 25"},null,null,null,{"$f":"Activité3!M32","v":0}]
[]
[]
["Note proposée sur 20 (0,5 pts)",null,{"$f":"Activité1!M35","v":"Note"},null,null,null,null,{"$f":"Activité2!M35","v":"Note"},null,null,null,null,{"$f":"Activité3!M35","v":"Note"}]
[]
["Note avec coef",null,{"$f":"Activité1!M37","v":""},null,null,null,null,{"$f":"Activité2!M37","v":""},null,null,null,null,{"$f":"Activité3!M37","v":""}]